{"text_format":"3","workbook":"xlsx","n_sheets":14,"sheets":["FU","Inconsistencias","CRI-M","COG-M","BDI","CRI-RYP","CRI-DE","COG-RYP","COG-FF","CTG-FF","CF","CA","EA","Plantilla"],"not_rendered":{"images":1,"macros":1,"defined_names":12},"read":"whole","date_system":"1900"}

{"sheet":"FU","index":0,"n_rows":473,"n_cols":38,"rows_kept":473,"hidden":true,"merged":[[2,10,2,29],[3,10,3,29],[5,1,5,38],[6,1,6,10],[6,11,6,21],[6,22,6,38],[7,1,7,3],[7,4,7,10],[7,11,7,18],[7,19,7,23],[7,24,7,28],[7,29,7,30],[7,31,7,36],[7,37,7,38],[8,1,8,3],[8,4,8,10],[8,11,8,18],[8,19,8,23],[8,24,8,28],[8,29,8,30],[8,31,8,36],[8,37,8,38],[9,1,9,25],[9,26,9,38],[10,1,10,25],[10,26,10,38],[12,1,12,9],[12,10,12,38],[13,1,15,9],[13,10,15,38],[16,1,16,15],[16,16,16,19],[16,20,16,34],[16,35,16,38],[17,16,17,19],[17,35,17,38],[18,14,18,15],[18,16,18,19],[18,35,18,38],[19,16,19,19],[19,35,19,38],[20,16,20,19],[20,35,20,38],[21,16,21,19],[21,35,21,38],[22,1,22,18],[22,19,22,24],[22,25,22,26],[22,27,22,32],[22,33,22,34],[22,35,22,36],[22,37,22,38],[24,1,24,38],[25,1,26,17],[25,18,25,24],[25,25,25,31],[25,32,25,38],[26,18,26,24],[26,25,26,31],[26,32,26,38],[27,1,27,6],[27,7,27,11],[27,12,27,17],[27,18,27,24],[27,25,27,31],[27,32,27,38],[28,1,28,6],[28,7,28,11],[28,12,28,17],[28,18,28,24],[28,25,28,31],[28,32,28,38],[29,1,29,38],[30,1,30,38],[40,1,40,38],[41,33,41,38],[42,33,42,38],[43,33,43,38],[44,33,44,38],[45,33,45,38],[46,33,46,38],[47,33,47,38],[48,33,48,38],[49,33,49,38],[50,33,50,38],[51,33,51,38],[52,1,52,38],[53,33,53,38],[54,33,54,38],[55,33,55,38],[56,33,56,38],[57,33,57,38],[58,33,58,38],[59,33,59,38],[60,33,60,38],[61,33,61,38],[62,33,62,38],[64,1,64,38],[65,1,65,38],[66,1,66,38],[67,1,67,38],[68,1,68,38],[69,1,69,38],[70,1,70,38],[71,1,71,38],[72,1,72,38],[73,1,73,38],[74,1,74,38],[75,1,75,38],[76,1,76,38],[77,1,77,38],[78,1,78,38],[79,1,79,38],[80,1,80,38],[81,1,81,38],[82,1,82,38],[84,18,84,36],[86,1,86,14],[86,25,86,38],[87,1,87,14],[87,25,87,38],[88,1,88,14],[88,25,88,38]]}
[]
[]
[{"$nulls":10},"VERIFICACIÓN Y ANÁLISIS DE DOCUMENTACIÓN"]
[{"$nulls":10},"Dirección de Profesionalización y Seguimiento"]
[]
[null,"INFORMACIÓN DE RECEPCIÓN"]
[null,"DATOS OFICIALÍA DE PARTES",{"$nulls":9},"OFICIO DE REMISIÓN",{"$nulls":10},"INFORMACIÓN QUE SE ACOMPAÑA"]
[null,"No.",null,null,"Fecha de recepción",{"$nulls":6},"No. de oficio",{"$nulls":7},"Fecha del oficio",{"$nulls":4},"Documentación",{"$nulls":4},"No.",null,"Medio electrónico",{"$nulls":5},"No."]
[]
[null,"Nombre del remitente",{"$nulls":24},"Cargo"]
[]
[null,{"$f":"LOOKUP(K14,M112:M473,N112:N473)","v":0},{"$f":"LOOKUP(K14,M112:M473,O112:O473)","v":0}]
[null,"CÓDIGO DEL ENTE",{"$nulls":8},"NOMBRE DEL ENTE PÚBLICO"]
[null,{"$f":"LOOKUP(K14,M112:M473,L112:L473)","v":"NA"},{"$nulls":8},{"$f":"Inconsistencias!B6","v":"SISTEMA PARA EL DESARROLLO INTEGRAL DE LA FAMILIA DEL MUNICIPIO DE SAN IGNACIO CERRO GORDO"}]
[]
[]
[null,"OBLIGACIÓN O DOCUMENTACIÓN REMITIDA",{"$nulls":14},"EJERCICIO",{"$nulls":3},"OBLIGACIÓN O DOCUMENTACIÓN REMITIDA",{"$nulls":14},"EJERCICIO"]
[null,"X","Presupuesto de egresos",{"$nulls":13},2020,{"$nulls":4},"Cuenta detallada de movimientos de fondos"]
[null,null,"Modificación al presupuesto de egresos",{"$nulls":10},"No.",{"$nulls":7},"Corte del primer semestre"]
[null,null,"Cuenta pública",{"$nulls":18},"Corte anual"]
[null,null,"1er. Informe de avances de gestión financiera",{"$nulls":18},"Estados financieros"]
[null,null,"2do. Informe de avances de gestión financiera",{"$nulls":18},"Otros"]
[null,"DOCUMENTACIÓN REMITIDA CORRESPONDE A UNA:",{"$nulls":17},"Normal",{"$nulls":5},{"$f":"IF(Inconsistencias!Q10=\"\",\"\",Inconsistencias!Q10)","v":"X"},null,"Complementaria",{"$nulls":5},{"$f":"IF(Inconsistencias!Q11=\"\",\"\",Inconsistencias!Q11)","v":""},null,"No.",null,{"$f":"IF(Inconsistencias!AC11=\"\",\"\",Inconsistencias!AC11)","v":""}]
[]
[null,"INFORMACIÓN DE LA APROBACIÓN AL PRESUPUESTO DE EGRESOS Y SUS MODIFICACIONES"]
[null,"ACTA DE APROBACIÓN",{"$nulls":16},"PRESUPUESTO",{"$nulls":6},"SEGÚN ACTA",{"$nulls":6},"SEGÚN FORMATO"]
[{"$nulls":18},"Aprobado"]
[null,"Acta Número",{"$nulls":5},"Fecha Acuerdo",{"$nulls":4},"Acuerdo Número",{"$nulls":5},"Modificado"]
[null,{"$f":"IF(Inconsistencias!B15=\"\",\"\",Inconsistencias!B15)","v":""},{"$nulls":5},{"$f":"IF(Inconsistencias!H15=\"\",\"\",Inconsistencias!H15)","v":""},{"$nulls":4},{"$f":"IF(Inconsistencias!O15=\"\",\"\",Inconsistencias!O15)","v":""},{"$nulls":5},"Vigente",{"$nulls":6},{"$f":"SUM(Z27:AF28)","v":0},{"$nulls":6},{"$f":"SUM(AG27:AM28)","v":0}]
[null,"VERIFICACIÓN DE CUMPLIMIENTO"]
[null,"PRESUPUESTO DE EGRESOS Y SUS MODIFICACIONES"]
[null,{"$f":"Inconsistencias!B17","v":"X"},"Resultado y proyección de ingresos - LDF"]
[null,{"$f":"Inconsistencias!B18","v":"X"},"Estimación de ingresos (Clasificación por rubro de ingresos de libre disposición y etiquetados)"]
[null,{"$f":"Inconsistencias!B19","v":"X"},"Resultado y proyección de egresos - LDF"]
[null,{"$f":"Inconsistencias!B20","v":"X"},"Presupuesto de egresos (Clasificador por objeto del gasto y fuente de financiamiento)"]
[null,{"$f":"Inconsistencias!B21","v":"X"},"Presupuesto de egresos (Clasificador por tipo de gasto, fuente de financiamiento y objeto del gasto)"]
[null,{"$f":"Inconsistencias!B22","v":"X"},"Presupuesto de egresos (Clasificación funcional del gasto)"]
[null,{"$f":"Inconsistencias!B23","v":"X"},"Presupuesto de egresos (Clasificación administrativa)"]
[null,{"$f":"Inconsistencias!B24","v":"X"},"Informe sobre estudios actuariales - LDF"]
[null,{"$f":"Inconsistencias!B25","v":"X"},"Plantilla de personal de carácter permanente"]
[null,"I N G R E S O S"]
[null,null,"Impuestos",{"$nulls":30},{"$f":"'CRI-DE'!F2","v":0}]
[null,null,"Cuotas y aportaciones de seguridad social",{"$nulls":30},{"$f":"'CRI-DE'!F21","v":0}]
[null,null,"Contribuciones de mejoras",{"$nulls":30},{"$f":"'CRI-DE'!F27","v":0}]
[null,null,"Derechos",{"$nulls":30},{"$f":"'CRI-DE'!F30","v":0}]
[null,null,"Productos",{"$nulls":30},{"$f":"'CRI-DE'!F60","v":{"v":130343,"d":"130,343"}}]
[null,null,"Aprovechamientos",{"$nulls":30},{"$f":"'CRI-DE'!F65","v":0}]
[null,null,"Ingresos por venta de bienes, prestación de servicios y otros ingresos",{"$nulls":30},{"$f":"'CRI-DE'!F79","v":0}]
[null,null,"Participaciones, aportaciones, convenios, incentivos derivados de la colaboración fiscal y fondos distintos de las aportaciones",{"$nulls":30},{"$f":"'CRI-DE'!F93","v":0}]
[null,null,"Transferencias, asignaciones, subsidios y subvenciones y pensiones y jubilaciones",{"$nulls":30},{"$f":"'CRI-DE'!F124","v":{"v":2074788,"d":"2,074,788"}}]
[null,null,"Ingresos derivados de financiamiento",{"$nulls":30},{"$f":"'CRI-DE'!F136","v":0}]
[{"$nulls":32},"ESTIMACIÓN DE INGRESOS",{"$f":"SUM(AH42:AM51)","v":{"v":2205131,"d":"2,205,131"}}]
[null,"E G R E S O S"]
[null,null,"Servicios personales",{"$nulls":30},{"$f":"'COG-RYP'!E3","v":{"v":1490399,"d":"1,490,399"}}]
[null,null,"Materiales y suministros",{"$nulls":30},{"$f":"'COG-RYP'!E4","v":{"v":370128,"d":"370,128"}}]
[null,null,"Servicios generales",{"$nulls":30},{"$f":"'COG-RYP'!E5","v":{"v":255372,"d":"255,372"}}]
[null,null,"Transferencias, asignaciones, subsidios y otras ayudas",{"$nulls":30},{"$f":"'COG-RYP'!E6","v":{"v":69816,"d":"69,816"}}]
[null,null,"Bienes muebles, inmuebles e intangibles",{"$nulls":30},{"$f":"'COG-RYP'!E7","v":{"v":19416,"d":"19,416"}}]
[null,null,"Inversión pública",{"$nulls":30},{"$f":"'COG-RYP'!E8","v":0}]
[null,null,"Inversiones financieras y otras provisiones",{"$nulls":30},{"$f":"'COG-RYP'!E9","v":0}]
[null,null,"Participaciones y aportaciones",{"$nulls":30},{"$f":"'COG-RYP'!E10","v":0}]
[null,null,"Deuda pública",{"$nulls":30},{"$f":"'COG-RYP'!E11","v":0}]
[{"$nulls":32},"PRESUPUESTO DE EGRESOS",{"$f":"SUM(AH54:AM62)","v":{"v":2205131,"d":"2,205,131"}}]
[]
[null,"INCONSISTENCIAS"]
[null,"Inconsistencia"]
[null,{"$f":"\"• \"&L94","v":"• No adjunta la información del presupuesto en formato electrónico."}]
[null,"• No se envía el acta de aprobación al presupuesto."]
[null,"• El presupuesto se aprobó despues del 30 de diciembre, incumpliendo lo establecido en el art. 218 de la LHM."]
[null,"• "]
[null,"• "]
[null,"• "]
[null,"• Se observa diferencia entre la estimación de ingresos fiscales (11) y los egresos pagaderos con dicha fuente de financiamiento."]
[null,"• "]
[null,"• "]
[null,"• "]
[null,"• "]
[null,"• Se observa diferencia entre la estimación de ingresos de otros recursos de libre disposición (17) y los egresos pagaderos con dicha fuente de financiamiento."]
[null,"• "]
[null,"• "]
[null,"• "]
[null,"• "]
[null,"• "]
[]
[{"$nulls":17},"Guadalajara, Jalisco; a"]
[]
[]
[null,"ELABORÓ",{"$nulls":23},"REVISÓ"]
[]
[]
[]
[]
[]
[{"$nulls":11},{"$f":"IF(AF9>0,\"\",\"No adjunta la información del presupuesto en formato electrónico.\")","v":"No adjunta la información del presupuesto en formato electrónico."}]
[{"$nulls":11},{"$f":"IF(B29=\"\",\"No se envía el acta de aprobación al presupuesto.\",\"\")","v":"No se envía el acta de aprobación al presupuesto."}]
[{"$nulls":11},{"$f":"IF(H29>43829,\"El presupuesto se aprobó despues del 30 de diciembre, incumpliendo lo establecido en el art. 218 de la LHM.\",\"\")","v":"El presupuesto se aprobó despues del 30 de diciembre, incumpliendo lo establecido en el art. 218 de la LHM."}]
[{"$nulls":11},{"$f":"IF(Z29=AG29,\"\",\"Existe diferencia entre lo establecido en el acta de aprobación y la información remitida en los formatos del presupuesto.\")","v":""}]
[{"$nulls":11},{"$f":"Inconsistencias!B28","v":""}]
[{"$nulls":11},{"$f":"Inconsistencias!B45","v":""}]
[{"$nulls":11},{"$f":"Inconsistencias!B46","v":"Se observa diferencia entre la estimación de ingresos fiscales (11) y los egresos pagaderos con dicha fuente de financiamiento."}]
[{"$nulls":11},{"$f":"Inconsistencias!B48","v":""}]
[{"$nulls":11},{"$f":"Inconsistencias!B50","v":""}]
[{"$nulls":11},{"$f":"Inconsistencias!B52","v":""}]
[{"$nulls":11},{"$f":"Inconsistencias!B54","v":""}]
[{"$nulls":11},{"$f":"Inconsistencias!B56","v":"Se observa diferencia entre la estimación de ingresos de otros recursos de libre disposición (17) y los egresos pagaderos con dicha fuente de financiamiento."}]
[{"$nulls":11},{"$f":"Inconsistencias!B58","v":""}]
[{"$nulls":11},{"$f":"Inconsistencias!B60","v":""}]
[{"$nulls":11},{"$f":"Inconsistencias!B62","v":""}]
[{"$nulls":11},{"$f":"Inconsistencias!B65","v":""}]
[{"$nulls":11},{"$f":"Inconsistencias!B67","v":""}]
[]
[{"$nulls":11},3111100100,"Acatic","Altos sur",21206]
[{"$nulls":11},3111100200,"Acatlán de Juárez","Lagunas",23241]
[{"$nulls":11},{"v":3112902302,"d":"3,112,902,302 "},"Administración de Estacionómetros para la Asistencia Social del Municipio de Zapotlán el Grande","Sur",100534]
[{"$nulls":11},3112800010,"Agencia Metropolitana de Seguridad Pública del Área Metropolitana de Guadalajara","Centro",1495189]
[{"$nulls":11},3112209300,"Agua y Saneamiento del Municipio de Tepatitlán","Altos sur",136123]
[{"$nulls":11},3111100300,"Ahualulco de Mercado","Valles",21714]
[{"$nulls":11},3112903906,"Albergue \"Las Cuadritas\" Fray Antonio Alcalde","Centro",1495189]
[{"$nulls":11},3111100400,"Amacueca","Sur",5545]
[{"$nulls":11},3111100500,"Amatitán","Valles",14648]
[{"$nulls":11},3111100600,"Ameca","Valles",57340]
[{"$nulls":11},3111100800,"Arandas","Altos sur",72812]
[{"$nulls":11},3112800001,"Asociación Intermunicipal para la Protección del Medio Ambiente y el Desarrollo Sustentable del Lago de Chapala","Ciénega",48839]
[{"$nulls":11},3111101000,"Atemajac de Brizuela","Sur",6655]
[{"$nulls":11},3111101100,"Atengo","Sierra de Amula",5400]
[{"$nulls":11},3111101200,"Atenguillo","Costa Sierra Occidente",4115]
[{"$nulls":11},3111101300,"Atotonilco el Alto","Ciénega",57717]
[{"$nulls":11},3111101400,"Atoyac","Lagunas",8276]
[{"$nulls":11},3111101500,"Autlán de Navarro","Sierra de Amula",57559]
[{"$nulls":11},3111101600,"Ayotlán","Ciénega",38291]
[{"$nulls":11},3111101700,"Ayutla","Costa Sierra Occidente",12664]
[{"$nulls":11},3111101900,"Bolaños","Norte",6820]
[{"$nulls":11},3111102000,"Cabo Corrientes","Costa Sierra Occidente",{"v":10029,"d":"10,029"}]
[{"$nulls":11},3111111700,"Cañadas de Obregón","Altos sur",{"v":4152,"d":"4,152 "}]
[{"$nulls":11},3111102100,"Casimiro Castillo","Costa sur",21475]
[{"$nulls":11},3112909701,"Centro de Estimulación para Personas con Discapacidad Intelectual de Tlajomulco de Zúñiga","Centro",416626]
[{"$nulls":11},3111103000,"Chapala","Sureste",48839]
[{"$nulls":11},3111103100,"Chimaltitán","Norte",3771]
[{"$nulls":11},3111103200,"Chiquilistlán","Sierra de Amula",5814]
[{"$nulls":11},3111102200,"Cihuatlán","Costa sur",39020]
[{"$nulls":11},3111102400,"Cocula","Lagunas",26174]
[{"$nulls":11},3111102500,"Colotlán","Norte",18091]
[{"$nulls":11},3112902301,"Comité de la Feria de Zapotlán el Grande","Sur",100534]
[{"$nulls":11},3112908201,"Comité del Carnaval Sayula","Lagunas",34829]
[{"$nulls":11},3111102600,"Concepción de Buenos Aires","Sureste",5933]
[{"$nulls":11},3112909801,"Consejo Municipal contra las Adicciones en San Pedro Tlaquepaque","Centro",608114]
[{"$nulls":11},"NA","Consejo Municipal del Deporte de Ahualulco de Mercado","Valles",21714]
[{"$nulls":11},"NA","Consejo Municipal del Deporte de Degollado, Jalisco","Ciénega",21132]
[{"$nulls":11},3112303900,"Consejo Municipal del Deporte de Guadalajara","Centro",1495189]
[{"$nulls":11},3112305000,"Consejo Municipal del Deporte de Jocotepec","Sureste",42164]
[{"$nulls":11},3112301800,"Consejo Municipal del Deporte de La Barca","Ciénega",64269]
[{"$nulls":11},3112306700,"Consejo Municipal del Deporte de Puerto Vallarta","Costa Sierra Occidente",255681]
[{"$nulls":11},3112309800,"Consejo Municipal del Deporte de San Pedro Tlaquepaque","Centro",608114]
[{"$nulls":11},3112310100,"Consejo Municipal del Deporte de Tonalá","Centro",478689]
[{"$nulls":11},3112311800,"Consejo Municipal del Deporte de Yahualica de González Gallo","Altos Sur ",22284]
[{"$nulls":11},3112312000,"Consejo Municipal del Deporte de Zapopan","Centro",1243756]
[{"$nulls":11},3112903902,"Consejo Social de Cooperación para el Desarrollo Urbano de Guadalajara","Centro",1495189]
[{"$nulls":11},3111102700,"Cuautitlán de García Barragán","Costa Sur",17322]
[{"$nulls":11},3111102800,"Cuautla","Sierra de Amula",2171]
[{"$nulls":11},3111102900,"Cuquío","Centro",17795]
[{"$nulls":11},3111103300,"Degollado","Ciénega",21132]
[{"$nulls":11},3112100100,"Desarrollo Integral de la Familia del Municipio de Acatic","Altos Sur",21206]
[{"$nulls":11},3112100200,"Desarrollo Integral de la Familia del Municipio de Acatlán de Juárez","Lagunas",23241]
[{"$nulls":11},3112100300,"Desarrollo Integral de la Familia del Municipio de Ahualulco de Mercado","Valles",21714]
[{"$nulls":11},3112100400,"Desarrollo Integral de la Familia del Municipio de Amacueca","Lagunas",5545]
[{"$nulls":11},3112100500,"Desarrollo Integral de la Familia del Municipio de Amatitán","Valles",14648]
[{"$nulls":11},3112100600,"Desarrollo Integral de la Familia del Municipio de Ameca","Valles",57340]
[{"$nulls":11},3112100800,"Desarrollo Integral de la Familia del Municipio de Arandas","Altos Sur",72812]
[{"$nulls":11},3112101000,"Desarrollo Integral de la Familia del Municipio de Atemajac de Brizuela","Lagunas",6655]
[{"$nulls":11},3112101100,"Desarrollo Integral de la Familia del Municipio de Atengo","Sierra de Amula",5400]
[{"$nulls":11},3112101200,"Desarrollo Integral de la Familia del Municipio de Atenguillo","Costa Sierra Occidental",4115]
[{"$nulls":11},3112101300,"Desarrollo Integral de la Familia del Municipio de Atotonilco el Alto","Ciénega ",57717]
[{"$nulls":11},3112101400,"Desarrollo Integral de la Familia del Municipio de Atoyac","Lagunas",8276]
[{"$nulls":11},3112101500,"Desarrollo Integral de la Familia del Municipio de Autlán de Navarro","Sierra de Amula",57559]
[{"$nulls":11},3112101600,"Desarrollo Integral de la Familia del Municipio de Ayotlán","Ciénega ",38291]
[{"$nulls":11},3112101700,"Desarrollo Integral de la Familia del Municipio de Ayutla","Costa Sierra Occidental",12664]
[{"$nulls":11},3112101900,"Desarrollo Integral de la Familia del Municipio de Bolaños","Norte",6820]
[{"$nulls":11},3112102000,"Desarrollo Integral de la Familia del Municipio de Cabo Corrientes","Costa Sierra Occidental",10029]
[{"$nulls":11},3112111700,"Desarrollo Integral de la Familia del Municipio de Cañadas de Obregón","Altos Sur",4152]
[{"$nulls":11},3112102100,"Desarrollo Integral de la Familia del Municipio de Casimiro Castillo","Costa Sur",21475]
[{"$nulls":11},3112103000,"Desarrollo Integral de la Familia del Municipio de Chapala","Sureste",48839]
[{"$nulls":11},3112103100,"Desarrollo Integral de la Familia del Municipio de Chimaltitán","Norte",3771]
[{"$nulls":11},3112103200,"Desarrollo Integral de la Familia del Municipio de Chiquilistlán","Sierra de Amula",5814]
[{"$nulls":11},3112102200,"Desarrollo Integral de la Familia del Municipio de Cihuatlán","Costa Sur",39020]
[{"$nulls":11},3112102400,"Desarrollo Integral de la Familia del Municipio de Cocula","Lagunas",26174]
[{"$nulls":11},3112102500,"Desarrollo Integral de la Familia del Municipio de Colotlán","Norte",18091]
[{"$nulls":11},3112102600,"Desarrollo Integral de la Familia del Municipio de Concepción de Buenos Aires","Sureste",5933]
[{"$nulls":11},3112102700,"Desarrollo Integral de la Familia del Municipio de Cuautitlán de García Barragán","Costa Sur",17322]
[{"$nulls":11},3112102800,"Desarrollo Integral de la Familia del Municipio de Cuautla","Sierra de Amula",2171]
[{"$nulls":11},3112102900,"Desarrollo Integral de la Familia del Municipio de Cuquío","Centro",17795]
[{"$nulls":11},3112103300,"Desarrollo Integral de la Familia del Municipio de Degollado","Ciénega ",21132]
[{"$nulls":11},3112103400,"Desarrollo Integral de la Familia del Municipio de Ejutla","Sierra de Amula",2082]
[{"$nulls":11},3112100900,"Desarrollo Integral de la Familia del Municipio de El Arenal","Valles",17545]
[{"$nulls":11},3112103700,"Desarrollo Integral de la Familia del Municipio de El Grullo","Sierra de Amula",23845]
[{"$nulls":11},3112105400,"Desarrollo Integral de la Familia del Municipio de El Limón","Sierra de Amula",5499]
[{"$nulls":11},3112107000,"Desarrollo Integral de la Familia del Municipio de El Salto","Centro",138226]
[{"$nulls":11},3112103500,"Desarrollo Integral de la Familia del Municipio de Encarnación de Díaz","Altos Norte  ",51396]
[{"$nulls":11},3112103600,"Desarrollo Integral de la Familia del Municipio de Etzatlán","Valles",18632]
[{"$nulls":11},3112107900,"Desarrollo Integral de la Familia del Municipio de Gómez Farías","Sur",14011]
[{"$nulls":11},3112103800,"Desarrollo Integral de la Familia del Municipio de Guachinango","Costa Sierra Occidental",4323]
[{"$nulls":11},3112103900,"Desarrollo Integral de la Familia del Municipio de Guadalajara","Centro",1495189]
[{"$nulls":11},3112104000,"Desarrollo Integral de la Familia del Municipio de Hostotipaquillo","Valles",10284]
[{"$nulls":11},3112104100,"Desarrollo Integral de la Familia del Municipio de Huejúcar","Norte",6084]
[{"$nulls":11},3112104200,"Desarrollo Integral de la Familia del Municipio de Huejuquilla el Alto","Norte",8781]
[{"$nulls":11},3112104400,"Desarrollo Integral de la Familia del Municipio de Ixtlahuacán de los Membrillos","Centro",41060]
[{"$nulls":11},3112104500,"Desarrollo Integral de la Familia del Municipio de Ixtlahuacán del Río","Centro",19005]
[{"$nulls":11},3112104600,"Desarrollo Integral de la Familia del Municipio de Jalostotitlán","Altos Sur",31948]
[{"$nulls":11},3112104700,"Desarrollo Integral de la Familia del Municipio de Jamay","Ciénega ",22881]
[{"$nulls":11},3112104800,"Desarrollo Integral de la Familia del Municipio de Jesús María","Altos Sur",18634]
[{"$nulls":11},3112104900,"Desarrollo Integral de la Familia del Municipio de Jilotlán de los Dolores","Sur",9545]
[{"$nulls":11},3112105000,"Desarrollo Integral de la Familia del Municipio de Jocotepec","Sureste",42164]
[{"$nulls":11},3112105100,"Desarrollo Integral de la Familia del Municipio de Juanacatlán","Centro",13218]
[{"$nulls":11},3112105200,"Desarrollo Integral de la Familia del Municipio de Juchitlán","Sierra de Amula",5515]
[{"$nulls":11},3112101800,"Desarrollo Integral de la Familia del Municipio de La Barca","Ciénega ",64269]
[{"$nulls":11},3112104300,"Desarrollo Integral de la Familia del Municipio de La Huerta","Costa Sur",23428]
[{"$nulls":11},3112105700,"Desarrollo Integral de la Familia del Municipio de La Manzanilla de la Paz","Sureste",3755]
[{"$nulls":11},3112105300,"Desarrollo Integral de la Familia del Municipio de Lagos de Moreno","Altos Norte  ",153817]
[{"$nulls":11},3112105500,"Desarrollo Integral de la Familia del Municipio de Magdalena","Valles",21321]
[{"$nulls":11},3112105800,"Desarrollo Integral de la Familia del Municipio de Mascota","Costa Sierra Occidental",14245]
[{"$nulls":11},3112105900,"Desarrollo Integral de la Familia del Municipio de Mazamitla","Sureste",13225]
[{"$nulls":11},3112106000,"Desarrollo Integral de la Familia del Municipio de Mexticacán","Altos Sur",6034]
[{"$nulls":11},3112106100,"Desarrollo Integral de la Familia del Municipio de Mezquitic","Norte",18084]
[{"$nulls":11},3112106200,"Desarrollo Integral de la Familia del Municipio de Mixtlán","Costa Sierra Occidental",3574]
[{"$nulls":11},3112106300,"Desarrollo Integral de la Familia del Municipio de Ocotlán","Ciénega ",92967]
[{"$nulls":11},3112106400,"Desarrollo Integral de la Familia del Municipio de Ojuelos de Jalisco","Altos Norte  ",30097]
[{"$nulls":11},3112106500,"Desarrollo Integral de la Familia del Municipio de Pihuamo","Sur ",12119]
[{"$nulls":11},3112106600,"Desarrollo Integral de la Familia del Municipio de Poncitlán","Ciénega ",48408]
[{"$nulls":11},3112106700,"Desarrollo Integral de la Familia del Municipio de Puerto Vallarta","Costa Sierra Occidental",255681]
[{"$nulls":11},3112106900,"Desarrollo Integral de la Familia del Municipio de Quitupan","Sureste",8691]
[{"$nulls":11},3112107100,"Desarrollo Integral de la Familia del Municipio de San Cristóbal de la Barranca","Centro",3176]
[{"$nulls":11},3112107200,"Desarrollo Integral de la Familia del Municipio de San Diego de Alejandría","Altos Norte  ",6647]
[{"$nulls":11},3112111300,"Desarrollo Integral de la Familia del Municipio de San Gabriel","Sur",15310]
[{"$nulls":11},3112112500,"Desarrollo Integral de la Familia del Municipio de San Ignacio Cerro Gordo","Altos Sur",17626]
[{"$nulls":11},3112107300,"Desarrollo Integral de la Familia del Municipio de San Juan de los Lagos","Altos Norte  ",65219]
[{"$nulls":11},3112100700,"Desarrollo Integral de la Familia del Municipio de San Juanito de Escobedo","Valles",8896]
[{"$nulls":11},3112107400,"Desarrollo Integral de la Familia del Municipio de San Julián","Altos Sur",15454]
[{"$nulls":11},3112107500,"Desarrollo Integral de la Familia del Municipio de San Marcos","Valles",3762]
[{"$nulls":11},3112107600,"Desarrollo Integral de la Familia del Municipio de San Martín de Bolaños","Norte",3405]
[{"$nulls":11},3112107700,"Desarrollo Integral de la Familia del Municipio de San Martín Hidalgo","Lagunas",26306]
[{"$nulls":11},3112107800,"Desarrollo Integral de la Familia del Municipio de San Miguel el Alto","Altos Sur",31166]
[{"$nulls":11},3112109800,"Desarrollo Integral de la Familia del Municipio de San Pedro Tlaquepaque","Centro",608114]
[{"$nulls":11},3112108000,"Desarrollo Integral de la Familia del Municipio de San Sebastián del Oeste","Costa Sierra Occidental",5755]
[{"$nulls":11},3112108100,"Desarrollo Integral de la Familia del Municipio de Santa María de los Ángeles","Norte",3726]
[{"$nulls":11},3112105600,"Desarrollo Integral de la Familia del Municipio de Santa María del Oro","Sureste",2517]
[{"$nulls":11},3112108200,"Desarrollo Integral de la Familia del Municipio de Sayula","Lagunas",34829]
[{"$nulls":11},3112108300,"Desarrollo Integral de la Familia del Municipio de Tala","Valles",69031]
[{"$nulls":11},3112108400,"Desarrollo Integral de la Familia del Municipio de Talpa de Allende","Costa Sierra Occidental",14410]
[{"$nulls":11},3112108500,"Desarrollo Integral de la Familia del Municipio de Tamazula de Gordiano","Sur",37986]
[{"$nulls":11},3112108600,"Desarrollo Integral de la Familia del Municipio de Tapalpa","Lagunas",18096]
[{"$nulls":11},3112108700,"Desarrollo Integral de la Familia del Municipio de Tecalitlán","Sur",16847]
[{"$nulls":11},3112108900,"Desarrollo Integral de la Familia del Municipio de Techaluta de Montenegro","Lagunas",3511]
[{"$nulls":11},3112108800,"Desarrollo Integral de la Familia del Municipio de Tecolotlán","Sierra de Amula",16573]
[{"$nulls":11},3112109000,"Desarrollo Integral de la Familia del Municipio de Tenamaxtlán","Sierra de Amula",7051]
[{"$nulls":11},3112109100,"Desarrollo Integral de la Familia del Municipio de Teocaltiche","Altos Norte  ",40105]
[{"$nulls":11},3112109200,"Desarrollo Integral de la Familia del Municipio de Teocuitatlán de Corona","Lagunas",10837]
[{"$nulls":11},3112109300,"Desarrollo Integral de la Familia del Municipio de Tepatitlán de Morelos","Altos Sur",136123]
[{"$nulls":11},3112109400,"Desarrollo Integral de la Familia del Municipio de Tequila","Valles ",40697]
[{"$nulls":11},3112109500,"Desarrollo Integral de la Familia del Municipio de Teuchitlán","Valles",9088]
[{"$nulls":11},3112109600,"Desarrollo Integral de la Familia del Municipio de Tizapán el Alto","Sureste",20857]
[{"$nulls":11},3112109700,"Desarrollo Integral de la Familia del Municipio de Tlajomulco de Zúñiga","Centro",416626]
[{"$nulls":11},3112109900,"Desarrollo Integral de la Familia del Municipio de Tolimán","Sur",9591]
[{"$nulls":11},3112110000,"Desarrollo Integral de la Familia del Municipio de Tomatlán","Costa Sur",35050]
[{"$nulls":11},3112110100,"Desarrollo Integral de la Familia del Municipio de Tonalá","Centro",478689]
[{"$nulls":11},3112110200,"Desarrollo Integral de la Familia del Municipio de Tonaya","Sierra de Amula",5930]
[{"$nulls":11},3112110300,"Desarrollo Integral de la Familia del Municipio de Tonila","Sur",7256]
[{"$nulls":11},3112110400,"Desarrollo Integral de la Familia del Municipio de Totatiche","Norte ",4435]
[{"$nulls":11},3112110500,"Desarrollo Integral de la Familia del Municipio de Tototlán","Ciénega ",21871]
[{"$nulls":11},3112110600,"Desarrollo Integral de la Familia del Municipio de Tuxcacuesco","Sierra de Amula",4234]
[{"$nulls":11},3112110700,"Desarrollo Integral de la Familia del Municipio de Tuxcueca","Sureste",6316]
[{"$nulls":11},3112110800,"Desarrollo Integral de la Familia del Municipio de Tuxpan","Sur",34182]
[{"$nulls":11},3112110900,"Desarrollo Integral de la Familia del Municipio de Unión de San Antonio","Altos Norte  ",17325]
[{"$nulls":11},3112111000,"Desarrollo Integral de la Familia del Municipio de Unión de Tula","Sierra de Amula",13737]
[{"$nulls":11},3112111100,"Desarrollo Integral de la Familia del Municipio de Valle de Guadalupe","Altos Sur",6705]
[{"$nulls":11},3112111200,"Desarrollo Integral de la Familia del Municipio de Valle de Juárez","Sureste",5798]
[{"$nulls":11},3112111400,"Desarrollo Integral de la Familia del Municipio de Villa Corona","Lagunas",16969]
[{"$nulls":11},3112111500,"Desarrollo Integral de la Familia del Municipio de Villa Guerrero","Norte ",5638]
[{"$nulls":11},3112111600,"Desarrollo Integral de la Familia del Municipio de Villa Hidalgo","Altos Norte  ",18711]
[{"$nulls":11},3112106800,"Desarrollo Integral de la Familia del Municipio de Villa Purificación","Costa Sur ",11623]
[{"$nulls":11},3112111800,"Desarrollo Integral de la Familia del Municipio de Yahualica de González Gallo","Altos Sur ",22284]
[{"$nulls":11},3112111900,"Desarrollo Integral de la Familia del Municipio de Zacoalco de Torres","Lagunas",27901]
[{"$nulls":11},3112112000,"Desarrollo Integral de la Familia del Municipio de Zapopan","Centro",1243756]
[{"$nulls":11},3112112100,"Desarrollo Integral de la Familia del Municipio de Zapotiltic","Sur ",29192]
[{"$nulls":11},3112112200,"Desarrollo Integral de la Familia del Municipio de Zapotitlán de Vadillo","Sur",6685]
[{"$nulls":11},3112112300,"Desarrollo Integral de la Familia del Municipio de Zapotlán del Rey","Ciénega ",17585]
[{"$nulls":11},3112102300,"Desarrollo Integral de la Familia del Municipio de Zapotlán el Grande","Sur",100534]
[{"$nulls":11},3112112400,"Desarrollo Integral de la Familia del Municipio de Zapotlanejo","Centro",63636]
[{"$nulls":11},3111103400,"Ejutla","Sierra de Amula",2082]
[{"$nulls":11},3111100900,"El Arenal","Valles",17545]
[{"$nulls":11},3111103700,"El Grullo","Sierra de Amula",23845]
[{"$nulls":11},3111105400,"El Limón","Sierra de Amula",5499]
[{"$nulls":11},3111107000,"El Salto","Centro",138226]
[{"$nulls":11},3111103500,"Encarnación de Díaz","Altos Norte  ",51396]
[{"$nulls":11},3111103600,"Etzatlán","Valles",18632]
[{"$nulls":11},3112712004,"Fideicomiso Coeficiente de Utilización del Suelo","Centro",1495189]
[{"$nulls":11},"NA","Fideicomiso de Administración, Garantía y Fuente de Pago para la concesión de Alumbrado Público del Municipio de Zapopan","Centro",1243756]
[{"$nulls":11},3112712006,"Fideicomiso de Equipamiento e Infraestructura Urbana y Vial en la Zona del Bajío","Valles",57340]
[{"$nulls":11},3112706701,"Fideicomiso de Turismo de Puerto Vallarta","Costa Sierra Occidental",255681]
[{"$nulls":11},3112712005,"Fideicomiso Hecho por Mujeres de Zapopan","Centro",1243756]
[{"$nulls":11},3112712001,"Fideicomiso Irrevocable de Garantía, Administración y Fuente de Pago (Zapopan)","Centro",1243756]
[{"$nulls":11},3112712002,"Fideicomiso Maestro de Fomento Económico para el Municipio de Zapopan","Centro",1243756]
[{"$nulls":11},3112712003,"Fideicomiso Revocable de Administración, Inversión y Fuente de Pago \"Av. Juan Palomar Arias\"","Centro",1495189]
[{"$nulls":11},3111107900,"Gómez Farías","Sur",14011]
[{"$nulls":11},3111103800,"Guachinango","Costa Sierra Occidental",4323]
[{"$nulls":11},3111103900,"Guadalajara","Centro",1495189]
[{"$nulls":11},3111104000,"Hostotipaquillo","Valles",10284]
[{"$nulls":11},3111104100,"Huejúcar","Norte",6084]
[{"$nulls":11},3111104200,"Huejuquilla el Alto","Norte",8781]
[{"$nulls":11},3112509700,"Instituto de Alternativas para los Jóvenes de Tlajomulco de Zúñiga","Centro",416626]
[{"$nulls":11},3112510100,"Instituto de Alternativas para los Jóvenes de Tonalá","Centro",478689]
[{"$nulls":11},3112509100,"Instituto de Atención a la Juventud Teocaltichense","Altos Norte  ",40105]
[{"$nulls":11},3112309700,"Instituto de Cultura, Recreación y Deporte del Municipio de Tlajomulco de Zúñiga","Centro",416626]
[{"$nulls":11},3112501800,"Instituto de la Juventud de La Barca","Ciénega ",64269]
[{"$nulls":11},3112505000,"Instituto de la Juventud Jocotepec","Sureste",42164]
[{"$nulls":11},3112511300,"Instituto de la Juventud San Gabriel","Sur",15310]
[{"$nulls":11},3112511800,"Instituto de la Juventud Yahualicense","Altos Sur ",22284]
[{"$nulls":11},3112409100,"Instituto de la Mujer de Teocaltiche","Altos Norte  ",40105]
[{"$nulls":11},3112409000,"Instituto de la Mujer Tenamaxtlán","Sierra de Amula",7051]
[{"$nulls":11},3112402900,"Instituto de las Mujeres de Cuquío","Centro",17795]
[{"$nulls":11},2112900700,"Instituto Metropolitano de Planeación","Centro",1495189]
[{"$nulls":11},3112503900,"Instituto Municipal de Atención a la Juventud de Guadalajara","Centro",1495189]
[{"$nulls":11},3112509800,"Instituto Municipal de la Juventud en San Pedro Tlaquepaque","Centro",608114]
[{"$nulls":11},3112505900,"Instituto Municipal de la Juventud Mazamitla","Sureste",13225]
[{"$nulls":11},3112404900,"Instituto Municipal de la Mujer de Jilotlán","Sur",9545]
[{"$nulls":11},3112410100,"Instituto Municipal de la Mujer de Tonalá","Centro",478689]
[{"$nulls":11},3112412200,"Instituto Municipal de la Mujer de Zapotitlán de Vadillo","Sur",6685]
[{"$nulls":11},3112401500,"Instituto Municipal de la Mujer del Municipio de Autlán de Navarro","Sierra de Amula",57559]
[{"$nulls":11},3112401800,"Instituto Municipal de la Mujer en La Barca","Ciénega ",64269]
[{"$nulls":11},3112407200,"Instituto Municipal de la Mujer en San Diego de Alejandría","Altos Norte  ",6647]
[{"$nulls":11},3112412500,"Instituto Municipal de la Mujer en San Ignacio Cerro Gordo","Altos Sur",17626]
[{"$nulls":11},3112402300,"Instituto Municipal de la Mujer en Zapotlán el Grande","Sur",100534]
[{"$nulls":11},3112406500,"Instituto Municipal de la Mujer Pihuamense en Pihuamo","Sur ",12119]
[{"$nulls":11},3112409700,"Instituto Municipal de la Mujer Tlajomulquense de Tlajomulco de Zúñiga","Centro",416626]
[{"$nulls":11},3112411800,"Instituto Municipal de la Mujer Yahualicense de Yahualica de González Gallo","Altos Sur ",22284]
[{"$nulls":11},3112903901,"Instituto Municipal de la Vivienda de Guadalajara","Centro",1495189]
[{"$nulls":11},3112403700,"Instituto Municipal de las Mujeres de El Grullo","Sierra de Amula",23845]
[{"$nulls":11},3112405900,"Instituto Municipal de las Mujeres de Mazamitla","Sureste",13225]
[{"$nulls":11},3112407400,"Instituto Municipal de las Mujeres de San Julián","Altos Sur",15454]
[{"$nulls":11},3112403900,"Instituto Municipal de las Mujeres en Guadalajara","Centro",1495189]
[{"$nulls":11},3112404700,"Instituto Municipal de las Mujeres en Jamay","Ciénega ",22881]
[{"$nulls":11},3112408500,"Instituto Municipal de las Mujeres Tamazulenses","Sur",37986]
[{"$nulls":11},3112409800,"Instituto Municipal de las Mujeres y para la Igualdad Sustantiva en San Pedro Tlaquepaque","Centro",608114]
[{"$nulls":11},3112412000,"Instituto Municipal de las Mujeres Zapopanas para la Igualdad Sustantiva","Centro",1243756]
[{"$nulls":11},3112905301,"Instituto Municipal de Planeación de Lagos de Moreno","Altos Norte  ",153817]
[{"$nulls":11},3112405000,"Instituto para la Igualdad Sustantiva entre Hombres y Mujeres de Jocotepec","Sureste",42164]
[{"$nulls":11},3112408700,"Instituto Tecalitlense de la Mujer","Sur",16847]
[{"$nulls":11},3112906700,"Instituto Vallartense de Cultura","Costa Sierra Occidental",255681]
[{"$nulls":11},3112502300,"Instituto Zapotlense de la Juventud de Zapotlán el Grande","Sur",100534]
[{"$nulls":11},3111104400,"Ixtlahuacán de los Membrillos","Centro",41060]
[{"$nulls":11},3111104500,"Ixtlahuacán del Río","Centro",19005]
[{"$nulls":11},3111104600,"Jalostotitlán","Altos Sur",31948]
[{"$nulls":11},3111104700,"Jamay","Ciénega ",22881]
[{"$nulls":11},3111104800,"Jesús María","Altos Sur",18634]
[{"$nulls":11},3111104900,"Jilotlán de los Dolores","Sur",9545]
[{"$nulls":11},3111105000,"Jocotepec","Sureste",42164]
[{"$nulls":11},3111105100,"Juanacatlán","Centro",13218]
[{"$nulls":11},3111105200,"Juchitlán","Sierra de Amula",5515]
[{"$nulls":11},3112800002,"Junta Intermunicipal de Medio Ambiente Altos Sur"]
[{"$nulls":11},3112800003,"Junta Intermunicipal de Medio Ambiente de la Costa Sur"]
[{"$nulls":11},3112800004,"Junta Intermunicipal de Medio Ambiente de Sierra Occidental y Costa"]
[{"$nulls":11},3112800008,"Junta Intermunicipal de Medio Ambiente para la Gestión Integral de la Cuenca del Río Coahuayana"]
[{"$nulls":11},3112800005,"Junta Intermunicipal de Medio Ambiente para la Gestión Integral de la Región Norte del Estado de Jalisco"]
[{"$nulls":11},3112800006,"Junta Intermunicipal de Medio Ambiente para la Gestión Integral de la Región Valles"]
[{"$nulls":11},3112800007,"Junta Intermunicipal del Medio Ambiente para la Gestión Integral de la Cuenca Baja del Río Ayuquila"]
[{"$nulls":11},3111101800,"La Barca","Ciénega ",64269]
[{"$nulls":11},3111104300,"La Huerta","Costa Sur",23428]
[{"$nulls":11},3111105700,"La Manzanilla de la Paz","Sureste",3755]
[{"$nulls":11},3111105300,"Lagos de Moreno","Altos Norte  ",153817]
[{"$nulls":11},3111105500,"Magdalena","Valles",21321]
[{"$nulls":11},3111105800,"Mascota","Costa Sierra Occidental",14245]
[{"$nulls":11},3111105900,"Mazamitla","Sureste",13225]
[{"$nulls":11},3111106000,"Mexticacán","Altos Sur",6034]
[{"$nulls":11},3111106100,"Mezquitic","Norte",18084]
[{"$nulls":11},3111106200,"Mixtlán","Costa Sierra Occidental",3574]
[{"$nulls":11},3111106300,"Ocotlán","Ciénega ",92967]
[{"$nulls":11},3111106400,"Ojuelos de Jalisco","Altos Norte  ",30097]
[{"$nulls":11},3112905302,"Patronato de las Instalaciones de la Feria de Lagos de Moreno","Altos Norte  ",153817]
[{"$nulls":11},3112910101,"Patronato del Centro Histórico y Barrios Tradicionales de Tonalá, Jalisco \"Tonalá Mágico\"","Centro",478689]
[{"$nulls":11},3112906701,"Patronato del Centro Histórico y Franja Turística de Puerto Vallarta","Costa Sierra Occidental",255681]
[{"$nulls":11},3112903904,"Patronato del Centro Histórico, Barrios y Zonas Tradicionales de la ciudad de Guadalajara","Centro",1495189]
[{"$nulls":11},3112909802,"Patronato Nacional de la Cerámica","Centro",608114]
[{"$nulls":11},3111106500,"Pihuamo","Sur ",12119]
[{"$nulls":11},3111106600,"Poncitlán","Ciénega ",48408]
[{"$nulls":11},3111106700,"Puerto Vallarta","Costa Sierra Occidental",255681]
[{"$nulls":11},3111106900,"Quitupan","Sureste",8691]
[{"$nulls":11},3112903905,"Red de Bosques Urbanos de Guadalajara","Centro",1495189]
[{"$nulls":11},3111107100,"San Cristóbal de la Barranca","Centro",3176]
[{"$nulls":11},3111107200,"San Diego de Alejandría","Altos Norte  ",6647]
[{"$nulls":11},3111111300,"San Gabriel","Sur",15310]
[{"$nulls":11},3111112500,"San Ignacio Cerro Gordo","Altos Sur",17626]
[{"$nulls":11},3111107300,"San Juan de los Lagos","Altos Norte  ",65219]
[{"$nulls":11},3111100700,"San Juanito de Escobedo","Valles",8896]
[{"$nulls":11},3111107400,"San Julián","Altos Sur",15454]
[{"$nulls":11},3111107500,"San Marcos","Valles",3762]
[{"$nulls":11},3111107600,"San Martín de Bolaños","Norte",3405]
[{"$nulls":11},3111107700,"San Martín Hidalgo","Lagunas",26306]
[{"$nulls":11},3111107800,"San Miguel el Alto","Altos Sur",31166]
[{"$nulls":11},3111109800,"San Pedro Tlaquepaque","Centro",608114]
[{"$nulls":11},3111108000,"San Sebastián del Oeste","Costa Sierra Occidental",5755]
[{"$nulls":11},3111108100,"Santa María de los Ángeles","Norte",3726]
[{"$nulls":11},3111105600,"Santa María del Oro","Sureste",2517]
[{"$nulls":11},3111108200,"Sayula","Lagunas",34829]
[{"$nulls":11},3112612000,"Servicios de Salud del Municipio de Zapopan","Centro",1243756]
[{"$nulls":11},3112204400,"Sistema Administrativo Municipal de Agua Potable y Alcantarillado de Ixtlahuacán de los Membrillos","Centro",41060]
[{"$nulls":11},3112201800,"Sistema Barquense de Agua Potable, Alcantarillado y Saneamiento","Ciénega ",64269]
[{"$nulls":11},3112200600,"Sistema de Agua Potable Alcantarillado y Saneamiento del Municipio de Ameca","Valles",57340]
[{"$nulls":11},3112205800,"Sistema de Agua Potable y Alcantarillado de Mascota","Costa Sierra Occidental",14245]
[{"$nulls":11},3112211000,"Sistema de Agua Potable y Alcantarillado del Municipio de Unión de Tula","Sierra de Amula",13737]
[{"$nulls":11},3112205500,"Sistema de Agua Potable, Alcantarillado y Saneamiento de Magdalena","Valles",21321]
[{"$nulls":11},3112200400,"Sistema de Agua Potable, Alcantarillado y Saneamiento del Municipio de Amacueca (SAPASA)","Lagunas",5545]
[{"$nulls":11},3112200800,"Sistema de Agua Potable, Alcantarillado y Saneamiento del Municipio de Arandas","Altos Sur",72812]
[{"$nulls":11},3112201300,"Sistema de Agua Potable, Alcantarillado y Saneamiento del Municipio de Atotonilco el Alto (SAPAMA)","Ciénega ",57717]
[{"$nulls":11},3112203000,"Sistema de Agua Potable, Alcantarillado y Saneamiento del Municipio de Chapala (SIMAPA)","Sureste",48839]
[{"$nulls":11},3112202500,"Sistema de Agua Potable, Alcantarillado y Saneamiento del Municipio de Colotlán","Norte",18091]
[{"$nulls":11},3112203300,"Sistema de Agua Potable, Alcantarillado y Saneamiento del Municipio de Degollado (SIAPADEG)","Ciénega ",21132]
[{"$nulls":11},3112204700,"Sistema de Agua Potable, Alcantarillado y Saneamiento del Municipio de Jamay (SIMAPAS)","Ciénega ",22881]
[{"$nulls":11},3112204300,"Sistema de Agua Potable, Alcantarillado y Saneamiento del Municipio de La Huerta","Costa Sur",23428]
[{"$nulls":11},3112212500,"Sistema de Agua Potable, Alcantarillado y Saneamiento del Municipio de San Ignacio Cerro Gordo","Altos Sur",17626]
[{"$nulls":11},3112207400,"Sistema de Agua Potable, Alcantarillado y Saneamiento del Municipio de San Julián (SAPAJ)","Altos Sur",15454]
[{"$nulls":11},3112207700,"Sistema de Agua Potable, Alcantarillado y Saneamiento del Municipio de San Martín Hidalgo","Lagunas",26306]
[{"$nulls":11},3112207800,"Sistema de Agua Potable, Alcantarillado y Saneamiento del Municipio de San Miguel el Alto (SAPASMA)","Altos Sur",31166]
[{"$nulls":11},3112208400,"Sistema de Agua Potable, Alcantarillado y Saneamiento del Municipio de Talpa de Allende","Costa Sierra Occidental",14410]
[{"$nulls":11},3112210500,"Sistema de Agua Potable, Alcantarillado y Saneamiento del Municipio de Tototlán","Ciénega ",21871]
[{"$nulls":11},3112211600,"Sistema de Agua Potable, Alcantarillado y Saneamiento del Municipio de Villa Hidalgo","Altos Norte  ",18711]
[{"$nulls":11},3112202300,"Sistema de Agua Potable, Alcantarillado y Saneamiento del Municipio de Zapotlán el Grande","Sur",100534]
[{"$nulls":11},3112205900,"Sistema de Agua Potable, Alcantarillados y Saneamiento del Municipio de Mazamitla","Sureste",13225]
[{"$nulls":11},3112206700,"Sistema de los Servicios de Agua Potable, Drenaje y Alcantarillado de Puerto Vallarta","Costa Sierra Occidental",255681]
[{"$nulls":11},3112208600,"Sistema Integral de Agua de Tapalpa","Lagunas",18096]
[{"$nulls":11},2112200200,"Sistema Intermunicipal de los Servicios de Agua Potable y Alcantarillado"]
[{"$nulls":11},3112800009,"Sistema Intermunicipal de Manejo de Residuos (SIMAR SURESTE)"]
[{"$nulls":11},3112800011,"Sistema Intermunicipal de Manejo de Residuos Lagunas (SIMAR Lagunas)"]
[{"$nulls":11},"NA","Sistema Intermunicipal de Manejo de Residuos Sur-Sureste (SIMAR Sur-Sureste)"]
[{"$nulls":11},3111108300,"Tala","Valles",69031]
[{"$nulls":11},3111108400,"Talpa de Allende","Costa Sierra Occidental",14410]
[{"$nulls":11},3111108500,"Tamazula de Gordiano","Sur",37986]
[{"$nulls":11},3111108600,"Tapalpa","Lagunas",18096]
[{"$nulls":11},3111108700,"Tecalitlán","Sur",16847]
[{"$nulls":11},3111108900,"Techaluta de Montenegro","Lagunas",3511]
[{"$nulls":11},3111108800,"Tecolotlán","Sierra de Amula",16573]
[{"$nulls":11},3111109000,"Tenamaxtlán","Sierra de Amula",7051]
[{"$nulls":11},3111109100,"Teocaltiche","Altos Norte  ",40105]
[{"$nulls":11},3111109200,"Teocuitatlán de Corona","Lagunas",10837]
[{"$nulls":11},3111109300,"Tepatitlán de Morelos","Altos Sur",136123]
[{"$nulls":11},3111109400,"Tequila","Valles ",40697]
[{"$nulls":11},3111109500,"Teuchitlán","Valles",9088]
[{"$nulls":11},3111109600,"Tizapán el Alto","Sureste",20857]
[{"$nulls":11},3111109700,"Tlajomulco de Zúñiga","Centro",416626]
[{"$nulls":11},3111109900,"Tolimán","Sur",9591]
[{"$nulls":11},3111110000,"Tomatlán","Costa Sur",35050]
[{"$nulls":11},3111110100,"Tonalá","Centro",478689]
[{"$nulls":11},3111110200,"Tonaya","Sierra de Amula",5930]
[{"$nulls":11},3111110300,"Tonila","Sur",7256]
[{"$nulls":11},3111110400,"Totatiche","Norte ",4435]
[{"$nulls":11},3111110500,"Tototlán","Ciénega ",21871]
[{"$nulls":11},3111110600,"Tuxcacuesco","Sierra de Amula",4234]
[{"$nulls":11},3111110700,"Tuxcueca","Sureste",6316]
[{"$nulls":11},3111110800,"Tuxpan","Sur",34182]
[{"$nulls":11},3111110900,"Unión de San Antonio","Altos Norte  ",17325]
[{"$nulls":11},3111111000,"Unión de Tula","Sierra de Amula",13737]
[{"$nulls":11},3111111100,"Valle de Guadalupe","Altos Sur",6705]
[{"$nulls":11},3111111200,"Valle de Juárez","Sureste",5798]
[{"$nulls":11},3111111400,"Villa Corona","Lagunas",16969]
[{"$nulls":11},3111111500,"Villa Guerrero","Norte ",5638]
[{"$nulls":11},3111111600,"Villa Hidalgo","Altos Norte  ",18711]
[{"$nulls":11},3111106800,"Villa Purificación","Costa Sur ",11623]
[{"$nulls":11},3111111800,"Yahualica de González Gallo","Altos Sur ",22284]
[{"$nulls":11},3111111900,"Zacoalco de Torres","Lagunas",27901]
[{"$nulls":11},3111112000,"Zapopan","Centro",1243756]
[{"$nulls":11},3111112100,"Zapotiltic","Sur ",29192]
[{"$nulls":11},3111112200,"Zapotitlán de Vadillo","Sur",6685]
[{"$nulls":11},3111112300,"Zapotlán del Rey","Ciénega ",17585]
[{"$nulls":11},3111102300,"Zapotlán el Grande","Sur",100534]
[{"$nulls":11},3111112400,"Zapotlanejo","Centro",63636]
[{"$nulls":11},3112903903,"Zoológico Guadalajara","Centro",1495189]

{"sheet":"Inconsistencias","index":1,"n_rows":67,"n_cols":27,"rows_kept":67,"merged":[[1,1,1,29],[2,1,2,29],[4,1,4,29],[5,1,7,29],[8,1,8,11],[8,12,8,15],[8,16,8,29],[9,2,9,11],[9,12,9,15],[9,17,9,29],[10,2,10,11],[10,12,10,15],[10,17,10,25],[10,26,10,27],[10,28,10,29],[11,1,11,13],[11,14,11,15],[11,16,11,27],[11,28,11,29],[12,1,12,29],[13,1,13,6],[13,7,13,13],[13,14,13,29],[14,1,14,6],[14,7,14,13],[14,14,14,29],[15,1,15,29],[25,1,25,29],[26,1,26,29],[27,1,33,29],[43,1,43,29],[44,1,44,29],[45,1,46,29],[47,1,48,29],[49,1,50,29],[51,1,52,29],[53,1,54,29],[55,1,56,29],[57,1,58,29],[59,1,60,29],[61,1,62,29],[63,1,63,29],[64,1,65,29],[66,1,67,29]]}
[]
[null,"PRESUPUESTO DE EGRESOS 2020"]
[null,"INFORMACIÓN ADICIONAL"]
[]
[null,"NOMBRE DEL ENTE PÚBLICO"]
[null,"SISTEMA PARA EL DESARROLLO INTEGRAL DE LA FAMILIA DEL MUNICIPIO DE SAN IGNACIO CERRO GORDO"]
[]
[]
[null,"DOCUMENTO REMITIDO",{"$nulls":10},"EJERCICIO",{"$nulls":3},"DOCUMENTACIÓN CORRESPONDE A:"]
[null,"X","Presupuesto de egresos",{"$nulls":9},2020,{"$nulls":3},"X","Normal"]
[null,null,"Modificación al presupuesto",{"$nulls":9},2020,{"$nulls":4},"Complementaria",{"$nulls":8},"No."]
[null,"La modificación al presupuesto es la No.",{"$nulls":14},"Se acompaña respaldo electrónico"]
[null,"INFORMACIÓN DE APROBACIÓN DEL PRESUPUESTO"]
[null,"Acta número",{"$nulls":5},"Fecha del acuerdo",{"$nulls":6},"Acuerdo número"]
[]
[null,"FORMATOS ELABORADOS"]
[null,{"$f":"IF('CRI-RYP'!D24>0,IF('CRI-RYP'!F24>0,\"X\",\"\"),\"\")","v":"X"},"Resultado y proyección de ingresos - LDF. "]
[null,{"$f":"IF('CRI-DE'!F141>0,\"X\",\"\")","v":"X"},"Estimación de ingresos (Clasificación por rubro de ingresos de libre disposición y etiquetados). "]
[null,{"$f":"IF('COG-RYP'!D24>0,IF('COG-RYP'!F24>0,\"X\",\"\"),\"\")","v":"X"},"Resultado y proyección de egresos - LDF. "]
[null,{"$f":"IF('COG-FF'!M429>0,\"X\",\"\")","v":"X"},"Presupuesto de egresos (Clasificador por objeto del gasto y fuente de financiamiento). "]
[null,{"$f":"IF('CTG-FF'!M8>0,\"X\",\"\")","v":"X"},"Presupuesto de egresos (Clasificador por tipo de gasto, fuente de financiamiento y objeto del gasto). "]
[null,{"$f":"IF(CF!C146>0,\"X\",\"\")","v":"X"},"Presupuesto de egresos (Clasificación funcional del gasto). "]
[null,{"$f":"IF(CA!D76>0,\"X\",\"\")","v":"X"},"Presupuesto de egresos (Clasificación administrativa). "]
[null,{"$f":"IF(SUM(EA!B2:F49)>0,\"X\",\"\")","v":"X"},"Informe sobre estudios actuariales - LDF."]
[null,{"$f":"IF(Plantilla!O429>0,\"X\",\"\")","v":"X"},"Plantilla de personal de carácter permanente. "]
[null,"Se considera que los formatos han sido correctamente elaborados,\nsalvo que se generen las siguientes:"]
[null,"Inconsistencia relacionada con la elaboración de formatos:"]
[null,{"$f":"IF(SUM(C35:C43)>0,\"No se elaboró el o los formato(s) de: \",\"\")&B35&B36&B37&B38&B39&B40&B41&B42&B43","v":""}]
[]
[]
[]
[]
[]
[]
[null,{"$f":"IF(B17=\"X\",\"\",C17)","v":""},{"$f":"IF(B17=\"X\",0,1)","v":0}]
[null,{"$f":"IF(B18=\"X\",\"\",C18)","v":""},{"$f":"IF(B18=\"X\",0,1)","v":0}]
[null,"",0]
[null,"",0]
[null,"",0]
[null,"",0]
[null,"",0]
[null,"",0]
[null,"",0]
[null,"Inconsistencia relacionada con el equilibrio ingreso vs. gasto:"]
[null,{"$f":"IF('CRI-RYP'!E24='COG-RYP'!E24,\"\",\"El total de la estimación de ingresos es diferente al total del presupuesto de egresos.\")","v":""}]
[null,{"$f":"IF(SUM('CRI-DE'!D2+'CRI-DE'!D21+'CRI-DE'!D27+'CRI-DE'!D30+'CRI-DE'!D60+'CRI-DE'!D65)='CTG-FF'!C8,\"\",\"Se observa diferencia entre la estimación de ingresos fiscales (11) y los egresos pagaderos con dicha fuente de financiamiento.\")","v":"Se observa diferencia entre la estimación de ingresos fiscales (11) y los egresos pagaderos con dicha fuente de financiamiento."}]
[]
[null,{"$f":"IF('CRI-DE'!E140='CTG-FF'!D8,\"\",\"Se observa diferencia entre la estimación de financiamiento interno (12) y los egresos pagaderos con dicha fuente de financiamiento.\")","v":""}]
[]
[null,{"$f":"IF('CRI-DE'!F79='CTG-FF'!F8,\"\",\"Se observa diferencia entre la estimación de ingresos propios (14) y los egresos pagaderos con dicha fuente de financiamiento.\")","v":""}]
[]
[null,{"$f":"IF(SUM('CRI-DE'!F95:F105)='CTG-FF'!G8,\"\",\"Se observa diferencia entre la estimación de ingresos de recursos federales de libre disposición (15) y los egresos pagaderos con dicha fuente de financiamiento.\")","v":""}]
[]
[null,{"$f":"IF('CRI-DE'!D106='CTG-FF'!H8,\"\",\"Se observa diferencia entre la estimación de ingresos de recursos estatales de libre disposición (16) y los egresos pagaderos con dicha fuente de financiamiento.\")","v":""}]
[]
[null,{"$f":"IF(('CRI-DE'!D115+'CRI-DE'!D124)='CTG-FF'!I8,\"\",\"Se observa diferencia entre la estimación de ingresos de otros recursos de libre disposición (17) y los egresos pagaderos con dicha fuente de financiamiento.\")","v":"Se observa diferencia entre la estimación de ingresos de otros recursos de libre disposición (17) y los egresos pagaderos con dicha fuente de financiamiento."}]
[]
[null,{"$f":"IF('CRI-DE'!E107='CTG-FF'!J8,\"\",\"Se observa diferencia entre la estimación de ingresos de recursos federales etiquetados (25) y los egresos pagaderos con dicha fuente de financiamiento.\")","v":""}]
[]
[null,{"$f":"IF('CRI-M'!O116='CTG-FF'!K8,\"\",\"Se observa diferencia entre la estimación de ingresos de recursos estatales etiquetados (26) y los egresos pagaderos con dicha fuente de financiamiento.\")","v":""}]
[]
[null,{"$f":"IF(('CRI-M'!O115+'CRI-M'!O123+'CRI-M'!O129+'CRI-M'!O133)='CTG-FF'!L8,\"\",\"Se observa diferencia entre la estimación de ingresos otros recursos de transferencia federal etiquetados (27) y los egresos pagaderos con dicha fuente de financiamiento.\")","v":""}]
[]
[null,"Inconsistencia relacionada con el monto presupuestado en sus diferentes clasificadores:"]
[null,{"$f":"IF('COG-RYP'!E24=CF!C146,\"\",\"El total del presupuesto de egresos en su clasificación por objeto del gasto difiere con el total de los egresos por clasificación funcional del gasto.\")","v":""}]
[]
[null,{"$f":"IF('COG-RYP'!E24=CA!D76,\"\",\"El total del presupuesto de egresos en su clasificación por objeto del gasto difiere con el total de los egresos en la clasificación administrativa.\")","v":""}]

{"sheet":"CRI-M","index":2,"n_rows":145,"n_cols":15,"rows_kept":145,"merged":[[144,0,144,1]]}
["CRI-LI",null,"ENERO","FEBRERO","MARZO","ABRIL","MAYO","JUNIO","JULIO","AGOSTO","SEPTIEMBRE","OCTUBRE","NOVIEMBRE","DICIEMBRE","TOTAL"]
[1000,"IMPUESTOS",{"$f":"C3+C5+C9+C10+C11+C12+C13+C19","v":0},{"$f":"D3+D5+D9+D10+D11+D12+D13+D19","v":0},0,0,0,0,0,0,0,0,0,0,{"$f":"SUM(C2:N2)","v":0}]
[1100,"Impuestos sobre los ingresos",{"$f":"SUM(C4)","v":0},{"$f":"SUM(D4)","v":0},0,0,0,0,0,0,0,0,0,0,{"$f":"SUM(C3:N3)","v":0}]
[1101,"Impuestos sobre espectáculos públicos",{"$nulls":12},0]
[1200,"Impuestos sobre el patrimonio",{"$f":"SUM(C6:C8)","v":0},{"$f":"SUM(D6:D8)","v":0},0,0,0,0,0,0,0,0,0,0,0]
[1201,"Impuesto predial",{"$nulls":12},0]
[1202,"Impuestos sobre transmisiones patrimoniales",{"$nulls":12},0]
[1203,"Impuestos sobre negocios jurídicos",{"$nulls":12},0]
[1300,"Impuestos sobre la producción, el consumo y las transacciones",0,0,0,0,0,0,0,0,0,0,0,0,0]
[1400,"Impuestos al comercio exterior",0,0,0,0,0,0,0,0,0,0,0,0,0]
[1500,"Impuestos sobre nóminas y asimilables",0,0,0,0,0,0,0,0,0,0,0,0,0]
[1600,"Impuestos ecológicos",0,0,0,0,0,0,0,0,0,0,0,0,0]
[1700,"Accesorios de impuestos",{"$f":"SUM(C14:C18)","v":0},{"$f":"SUM(D14:D18)","v":0},0,0,0,0,0,0,0,0,0,0,0]
[1701,"Recargos",{"$nulls":12},0]
[1702,"Actualizaciones",{"$nulls":12},0]
[1703,"Multas",{"$nulls":12},0]
[1704,"Gastos de ejecución",{"$nulls":12},0]
[1709,"Otros no especificados",{"$nulls":12},0]
[1800,"Otros impuestos",{"$f":"SUM(C20)","v":0},{"$f":"SUM(D20)","v":0},0,0,0,0,0,0,0,0,0,0,0]
[1801,"Otros impuestos",{"$nulls":12},0]
[2000,"CUOTAS Y APORTACIONES DE SEGURIDAD SOCIAL",{"$f":"SUM(C22:C26)","v":0},{"$f":"SUM(D22:D26)","v":0},0,0,0,0,0,0,0,0,0,0,0]
[2100,"Aportaciones para fondos de vivienda",{"$nulls":12},0]
[2200,"Cuotas para la seguridad social",{"$nulls":12},0]
[2300,"Cuotas de ahorro para el retiro",{"$nulls":12},0]
[2400,"Otras cuotas y aportaciones para la seguridad social",{"$nulls":12},0]
[2500,"Accesorios de cuotas y aportaciones de seguridad social",{"$nulls":12},0]
[3000,"CONTRIBUCIONES DE MEJORAS",{"$f":"SUM(C28)","v":0},{"$f":"SUM(D28)","v":0},0,0,0,0,0,0,0,0,0,0,0]
[3100,"Contribuciones de mejoras por obras públicas",{"$f":"SUM(C29)","v":0},0,0,0,0,0,0,0,0,0,0,0,0]
[3101,"Contribuciones de mejoras por obras públicas",{"$nulls":12},0]
[4000,"DERECHOS",{"$f":"C31+C36+C37+C52+C54","v":0},{"$f":"D31+D36+D37+D52+D54","v":0},0,0,0,0,0,0,0,0,0,0,0]
[4100,"Derechos por el uso, goce, aprovechamiento o explotación de bienes de dominio público",{"$f":"SUM(C32:C35)","v":0},{"$f":"SUM(D32:D35)","v":0},0,0,0,0,0,0,0,0,0,0,0]
[4101,"Derechos por el uso del piso",{"$nulls":12},0]
[4102,"Derechos por el uso de los estacionamientos",{"$nulls":12},0]
[4103,"Derechos de uso de cementerios y panteones municipales",{"$nulls":12},0]
[4104,"Derechos de concesiones y demás inmuebles de propiedad municipal",{"$nulls":12},0]
[4200,"Derechos a los hidrocarburos (Derogado)",{"$nulls":12},0]
[4300,"Derechos por prestación de servicios",{"$f":"SUM(C38:C51)","v":0},{"$f":"SUM(D38:D51)","v":0},0,0,0,0,0,0,0,0,0,0,0]
[4301,"Derechos de licencias y permisos de giros",{"$nulls":12},0]
[4302,"Derechos de licencias y permisos de anuncios",{"$nulls":12},0]
[4303,"Derechos de licencias de construcción, reconstrucción, reparación o demolición de obras",{"$nulls":12},0]
[4304,"Derechos de regularizaciones de los registros de obra",{"$nulls":12},0]
[4305,"Derechos de alineamiento, designación de número oficial e inspección",{"$nulls":12},0]
[4306,"Derechos de licencias de cambio de régimen de propiedad y urbanización",{"$nulls":12},0]
[4307,"Derechos de servicios de obra",{"$nulls":12},0]
[4308,"Derechos de servicios de sanidad",{"$nulls":12},0]
[4309,"Derechos de servicio de limpieza, recolección, traslado, tratamiento y disposición final de residuos",{"$nulls":12},0]
[4310,"Derechos de agua potable, drenaje, alcantarillado, tratamiento y disposición final de aguas residuales",{"$nulls":12},0]
[4311,"Derechos del rastro",{"$nulls":12},0]
[4312,"Derechos del registro civil",{"$nulls":12},0]
[4313,"Derechos de las certificaciones",{"$nulls":12},0]
[4314,"Derechos de los servicios de catastro",{"$nulls":12},0]
[4400,"Otros derechos",{"$f":"SUM(C53)","v":0},{"$f":"SUM(D53)","v":0},0,0,0,0,0,0,0,0,0,0,0]
[4401,"Otros derechos",{"$nulls":12},0]
[4500,"Accesorios de derechos",{"$f":"SUM(C55:C59)","v":0},{"$f":"SUM(D55:D59)","v":0},0,0,0,0,0,0,0,0,0,0,0]
[4501,"Recargos",{"$nulls":12},0]
[4502,"Actualizaciones",{"$nulls":12},0]
[4503,"Multas",{"$nulls":12},0]
[4504,"Gastos de ejecución",{"$nulls":12},0]
[4509,"Otros no especificados",{"$nulls":12},0]
[5000,"PRODUCTOS",{"$f":"C61+C64","v":{"v":10902,"d":"10,902"}},{"$f":"D61+D64","v":{"v":10902,"d":"10,902"}},{"v":10902,"d":"10,902"},{"v":10902,"d":"10,902"},{"v":10902,"d":"10,902"},{"v":10902,"d":"10,902"},{"v":10902,"d":"10,902"},{"v":10902,"d":"10,902"},{"v":10902,"d":"10,902"},{"v":10902,"d":"10,902"},{"v":10902,"d":"10,902"},{"v":10421,"d":"10,421"},{"v":130343,"d":"130,343"}]
[5100,"Productos",{"$f":"SUM(C62:C63)","v":{"v":10902,"d":"10,902"}},{"$f":"SUM(D62:D63)","v":{"v":10902,"d":"10,902"}},{"v":10902,"d":"10,902"},{"v":10902,"d":"10,902"},{"v":10902,"d":"10,902"},{"v":10902,"d":"10,902"},{"v":10902,"d":"10,902"},{"v":10902,"d":"10,902"},{"v":10902,"d":"10,902"},{"v":10902,"d":"10,902"},{"v":10902,"d":"10,902"},{"v":10421,"d":"10,421"},{"v":130343,"d":"130,343"}]
[5101,"Uso, goce, aprovechamiento o explotación de bienes de dominio privado",{"$nulls":12},0]
[5102,"Productos diversos",{"v":10902,"d":"10,902"},{"v":10902,"d":"10,902"},{"v":10902,"d":"10,902"},{"v":10902,"d":"10,902"},{"v":10902,"d":"10,902"},{"v":10902,"d":"10,902"},{"v":10902,"d":"10,902"},{"v":10902,"d":"10,902"},{"v":10902,"d":"10,902"},{"v":10902,"d":"10,902"},{"v":10902,"d":"10,902"},{"v":10421,"d":"10,421"},{"v":130343,"d":"130,343"}]
[5200,"Productos de capital (Derogado)",{"$nulls":12},0]
[6000,"APROVECHAMIENTOS",{"$f":"C66+C70+C73","v":0},{"$f":"D66+D70+D73","v":0},0,0,0,0,0,0,0,0,0,0,0]
[6100,"Aprovechamientos",{"$f":"SUM(C67:C69)","v":0},{"$f":"SUM(D67:D69)","v":0},0,0,0,0,0,0,0,0,0,0,0]
[6101,"Aprovechamientos de las sanciones, multas, honorarios y donativos",{"$nulls":12},{"$f":"SUM(C67:N67)","v":0}]
[6102,"Aprovechamientos de las indemnizaciones a favor del municipio",{"$nulls":12},0]
[6103,"Otros aprovechamientos",{"$nulls":12},0]
[6200,"Aprovechamientos patrimoniales",{"$f":"SUM(C71:C72)","v":0},{"$f":"SUM(D71:D72)","v":0},0,0,0,0,0,0,0,0,0,0,0]
[6201,"Aprovechamientos por el uso o enajenación de bienes",{"$nulls":12},0]
[6202,"Aprovechamientos por recuperación de capital o patrimonio invertido",{"$nulls":12},0]
[6300,"Accesorios de aprovechamientos",{"$f":"SUM(C74:C78)","v":0},{"$f":"SUM(D74:D78)","v":0},0,0,0,0,0,0,0,0,0,0,0]
[6301,"Recargos",{"$nulls":12},0]
[6302,"Actualizaciones",{"$nulls":12},0]
[6303,"Multas",{"$nulls":12},0]
[6304,"Gastos de ejecución",{"$nulls":12},0]
[6309,"Otros no especificados",{"$nulls":12},0]
[7000,"INGRESOS POR VENTAS DE BIENES, PRESTACIÓN DE SERVICIOS Y OTROS INGRESOS",{"$f":"C80+C82+C83+C85+C86+C87+C88+C90+C91","v":0},{"$f":"D80+D82+D83+D85+D86+D87+D88+D90+D91","v":0},0,0,0,0,0,0,0,0,0,0,0]
[7100,"Ingresos por venta de bienes y prestación de servicios de instituciones públicas de seguridad social",{"$f":"SUM(C81)","v":0},{"$f":"SUM(D81)","v":0},0,0,0,0,0,0,0,0,0,0,0]
[7101,"Ingresos por venta de bienes y prestación de servicios de instituciones públicas de seguridad social",{"$nulls":12},0]
[7200,"Ingresos por venta de bienes y prestación de servicios de empresas productivas del estado",{"$nulls":12},0]
[7300,"Ingresos por venta de bienes y prestación de servicios de entidades paraestatales y fideicomisos no empresariales y no financieros",{"$f":"SUM(C84)","v":0},{"$f":"SUM(D84)","v":0},0,0,0,0,0,0,0,0,0,0,0]
[7301,"Ingresos por venta de bienes y prestación de servicios de entidades paraestatales y fideicomisos no empresariales y no financieros",{"$nulls":12},0]
[7400,"Ingresos por venta de bienes y prestación de servicios de entidades paraestatales empresariales no financieras con participación estatal mayoritaria",{"$nulls":12},0]
[7500,"Ingresos por venta de bienes y prestación de servicios de entidades paraestatales empresariales financieras monetarias con participación estatal mayoritaria",{"$nulls":12},0]
[7600,"Ingresos por venta de bienes y prestación de servicios de entidades paraestatales empresariales financieras no monetarias con participación estatal mayoritaria",{"$nulls":12},0]
[7700,"Ingresos por venta de bienes y prestación de servicios de fideicomisos financieros públicos con participación estatal mayoritaria",{"$f":"SUM(C89)","v":0},{"$f":"SUM(D89)","v":0},0,0,0,0,0,0,0,0,0,0,0]
[7701,"Ingresos por venta de bienes y prestación de servicios de fideicomisos financieros públicos con participación estatal mayoritaria",{"$nulls":12},0]
[7800,"Ingresos por venta de bienes y prestación de servicios de los poderes legislativo y judicial, y de los órganos autónomos",{"$nulls":12},0]
[7900,"Otros ingresos",{"$f":"SUM(C92)","v":0},{"$f":"SUM(D92)","v":0},0,0,0,0,0,0,0,0,0,0,0]
[7901,"Otros ingresos",{"$nulls":12},0]
[8000,"PARTICIPACIONES, APORTACIONES, CONVENIOS, INCENTIVOS DERIVADOS DE LA COLABORACIÓN FISCAL Y FONDOS DISTINTOS DE LAS APORTACIONES",{"$f":"C94+C107+C110+C117+C123","v":0},{"$f":"D94+D107+D110+D117+D123","v":0},0,0,0,0,0,0,0,0,0,0,0]
[8100,"Participaciones",{"$f":"SUM(C95:C106)","v":0},{"$f":"SUM(D95:D106)","v":0},0,0,0,0,0,0,0,0,0,0,0]
[8101,"Fondo general de participaciones (federal)",{"$nulls":12},0]
[8102,"Fondo de fomento municipal (federal)",{"$nulls":12},0]
[8103,"Fondo de fiscalización y recaudación (federal)",{"$nulls":12},0]
[8104,"Fondo de compensación (federal)",{"$nulls":12},0]
[8105,"Fondo de extracción de hidrocarburos (federal)",{"$nulls":12},0]
[8106,"Impuesto especial sobre producción y servicios (federal)",{"$nulls":12},0]
[8107,"0.136% de la recaudación federal participable (federal)",{"$nulls":12},0]
[8108,"3.17% sobre extracción de petróleo (federal)",{"$nulls":12},0]
[8109,"Gasolinas y diésel (federal)",{"$nulls":12},0]
[8110,"Fondo del impuesto sobre la renta (federal)",{"$nulls":12},0]
[8111,"Fondo de estabilización de los ingresos de las entidades federativas (federal)",{"$nulls":12},0]
[8112,"Participaciones del estado",{"$nulls":12},0]
[8200,"Aportaciones",{"$f":"SUM(C108:C109)","v":0},{"$f":"SUM(D108:D109)","v":0},0,0,0,0,0,0,0,0,0,0,0]
[8201,"Fondo de aportaciones para la infraestructura social municipal",{"$nulls":12},0]
[8202,"Fondo de aportaciones para el fortalecimiento municipal",{"$nulls":12},0]
[8300,"Convenios",{"$f":"SUM(C111:C116)","v":0},{"$f":"SUM(D111:D116)","v":0},0,0,0,0,0,0,0,0,0,{"$f":"SUM(N111:N116)","v":0},{"$f":"SUM(C110:N110)","v":0}]
[8301,"Convenios de protección social en salud",{"$nulls":12},0]
[8302,"Convenios de descentralizados",{"$nulls":12},0]
[8303,"Convenio de reasignación",{"$nulls":12},0]
[8304,"Otros convenios y subsidios (Con ingresos de libre disposición)",{"$nulls":12},0]
[8304,"Otros convenios y subsidios (Con ingresos etiquetados federales)",{"$nulls":12},0]
[8304,"Otros convenios y subsidios (Con ingresos etiquetados estatales)",{"$nulls":12},{"$f":"SUM(C116:N116)","v":0}]
[8400,"Incentivos derivados de la colaboración fiscal",{"$f":"SUM(C118:C122)","v":0},{"$f":"SUM(D118:D122)","v":0},0,0,0,0,0,0,0,0,0,0,0]
[8401,"Tenencia o uso de vehículos",{"$nulls":12},0]
[8402,"Fondo de compensación ISAN",{"$nulls":12},0]
[8403,"Impuesto sobre automóviles nuevos",{"$nulls":12},0]
[8404,"Fondo de compensación de repecos-intermedios",{"$nulls":12},0]
[8405,"Otros incentivos económicos",{"$nulls":12},0]
[8500,"Fondos distintos de aportaciones",{"$f":"SUM(C124:C125)","v":0},{"$f":"SUM(D124:D125)","v":0},0,0,0,0,0,0,0,0,0,0,0]
[8501,"Fondo para entidades federativas y municipios productores de hidrocarburos",{"$nulls":12},0]
[8502,"Fondo minero",{"$nulls":12},0]
[9000,"TRANSFERENCIAS, ASIGNACIONES, SUBSIDIOS Y SUBVENCIONES Y PENSIONES Y JUBILACIONES",{"$f":"C127+C130+C131+C134+C135+C137+C138","v":{"v":172899,"d":"172,899"}},{"$f":"D127+D130+D131+D134+D135+D137+D138","v":{"v":172899,"d":"172,899"}},{"v":172899,"d":"172,899"},{"v":172899,"d":"172,899"},{"v":172899,"d":"172,899"},{"v":172899,"d":"172,899"},{"v":172899,"d":"172,899"},{"v":172899,"d":"172,899"},{"v":172899,"d":"172,899"},{"v":172899,"d":"172,899"},{"v":172899,"d":"172,899"},{"v":172899,"d":"172,899"},{"v":2074788,"d":"2,074,788"}]
[9100,"Transferencias y asignaciones",{"$f":"SUM(C128:C129)","v":0},{"$f":"SUM(D128:D129)","v":0},0,0,0,0,0,0,0,0,0,0,0]
[9101,"Transferencias y asignaciones (Con ingresos de libre disposición)",{"$nulls":12},0]
[9101,"Transferencias y asignaciones (Con ingresos etiquetados)",{"$nulls":12},0]
[9200,"Transferencias al resto del sector público (derogado)",{"$nulls":12},0]
[9300,"Subsidios y subvenciones",{"$f":"SUM(C132:C133)","v":{"v":172899,"d":"172,899"}},{"$f":"SUM(D132:D133)","v":{"v":172899,"d":"172,899"}},{"v":172899,"d":"172,899"},{"v":172899,"d":"172,899"},{"v":172899,"d":"172,899"},{"v":172899,"d":"172,899"},{"v":172899,"d":"172,899"},{"v":172899,"d":"172,899"},{"v":172899,"d":"172,899"},{"v":172899,"d":"172,899"},{"v":172899,"d":"172,899"},{"v":172899,"d":"172,899"},{"v":2074788,"d":"2,074,788"}]
[9301,"Subsidios y subvenciones (Con ingresos de libre disposición)",{"v":172899,"d":"172,899"},{"v":172899,"d":"172,899"},{"v":172899,"d":"172,899"},{"v":172899,"d":"172,899"},{"v":172899,"d":"172,899"},{"v":172899,"d":"172,899"},{"v":172899,"d":"172,899"},{"v":172899,"d":"172,899"},{"v":172899,"d":"172,899"},{"v":172899,"d":"172,899"},{"v":172899,"d":"172,899"},{"v":172899,"d":"172,899"},{"$f":"SUM(C132:N132)","v":{"v":2074788,"d":"2,074,788"}}]
[9301,"Subsidios y subvenciones (Con ingresos etiquetados)",{"$nulls":12},0]
[9400,"Ayudas sociales (derogado)",{"$nulls":12},0]
[9500,"Pensiones y jubilaciones",{"$f":"SUM(C136)","v":0},{"$f":"SUM(D136)","v":0},0,0,0,0,0,0,0,0,0,0,0]
[9501,"Pensiones y jubilaciones",{"$nulls":12},0]
[9600,"Transferencias a fideicomisos, mandatos y análogos (derogado)",{"$nulls":12},0]
[9700,"Transferencias del fondo mexicano del petróleo para la estabilización y el desarrollo",{"$f":"SUM(C139)","v":0},{"$f":"SUM(D139)","v":0},0,0,0,0,0,0,0,0,0,0,0]
[9701,"Transferencias del fondo mexicano del petróleo para la estabilización y el desarrollo",{"$nulls":12},0]
[{"v":0,"d":"0000"},"INGRESOS DERIVADOS DE FINANCIAMIENTO",{"$f":"C141+C142+C143","v":0},{"$f":"D141+D142+D143","v":0},0,0,0,0,0,0,0,0,0,0,0]
[{"v":100,"d":"0100"},"Endeudamiento interno",{"$nulls":12},0]
[{"v":200,"d":"0200"},"Endeudamiento externo",{"$nulls":12},0]
[{"v":300,"d":"0300"},"Financiamiento interno",{"$f":"SUM(C144)","v":0},{"$f":"SUM(D144)","v":0},0,0,0,0,0,0,0,0,0,0,0]
[{"v":301,"d":"0301"},"Financiamiento interno",{"$nulls":12},0]
["ESTIMACIÓN DE INGRESOS",null,{"$f":"C2+C21+C27+C30+C60+C65+C79+C93+C126+C140","v":{"v":183801,"d":"183,801"}},{"$f":"D2+D21+D27+D30+D60+D65+D79+D93+D126+D140","v":{"v":183801,"d":"183,801"}},{"v":183801,"d":"183,801"},{"v":183801,"d":"183,801"},{"v":183801,"d":"183,801"},{"v":183801,"d":"183,801"},{"v":183801,"d":"183,801"},{"v":183801,"d":"183,801"},{"v":183801,"d":"183,801"},{"v":183801,"d":"183,801"},{"v":183801,"d":"183,801"},{"v":183320,"d":"183,320"},{"v":2205131,"d":"2,205,131"}]

{"sheet":"COG-M","index":3,"n_rows":2088,"n_cols":16,"rows_kept":2088,"merged":[[1,1,1,2],[2,1,2,2],[3,0,6,0],[3,1,6,1],[8,0,13,0],[8,1,13,1],[14,0,17,0],[14,1,17,1],[18,1,18,2],[19,0,23,0],[19,1,23,1],[24,0,31,0],[24,1,31,1],[32,0,36,0],[32,1,36,1],[38,1,38,2],[39,0,43,0],[39,1,43,1],[44,0,49,0],[44,1,49,1],[50,0,55,0],[50,1,55,1],[56,0,61,0],[56,1,61,1],[64,0,68,0],[64,1,68,1],[69,0,73,0],[69,1,73,1],[74,1,74,2],[75,0,79,0],[75,1,79,1],[80,0,84,0],[80,1,84,1],[85,0,89,0],[85,1,89,1],[90,0,94,0],[90,1,94,1],[95,1,95,2],[96,0,101,0],[96,1,101,1],[102,0,107,0],[102,1,107,1],[108,0,112,0],[108,1,112,1],[113,0,118,0],[113,1,118,1],[119,0,123,0],[119,1,123,1],[124,0,128,0],[124,1,128,1],[129,1,129,2],[130,0,135,0],[130,1,135,1],[136,1,136,2],[137,0,141,0],[137,1,141,1],[142,0,146,0],[142,1,146,1],[147,1,147,2],[148,1,148,2],[149,0,153,0],[149,1,153,1],[154,0,158,0],[154,1,158,1],[159,0,163,0],[159,1,163,1],[164,0,168,0],[164,1,168,1],[169,0,173,0],[169,1,173,1],[174,0,178,0],[174,1,178,1],[179,0,183,0],[179,1,183,1],[184,0,188,0],[184,1,188,1],[189,1,189,2],[190,0,195,0],[190,1,195,1],[196,0,200,0],[196,1,200,1],[201,0,205,0],[201,1,205,1],[206,1,206,2],[216,1,216,2],[217,0,224,0],[217,1,224,1],[225,0,232,0],[225,1,232,1],[233,0,240,0],[233,1,240,1],[241,0,248,0],[241,1,248,1],[249,0,256,0],[249,1,256,1],[257,0,264,0],[257,1,264,1],[265,0,272,0],[265,1,272,1],[273,0,280,0],[273,1,280,1],[281,0,288,0],[281,1,288,1],[289,1,289,2],[290,0,294,0],[290,1,294,1],[295,0,299,0],[295,1,299,1],[300,0,307,0],[300,1,307,1],[308,0,312,0],[308,1,312,1],[313,0,320,0],[313,1,320,1],[321,0,325,0],[321,1,325,1],[326,0,330,0],[326,1,330,1],[331,1,331,2],[332,0,337,0],[332,1,337,1],[338,0,342,0],[338,1,342,1],[343,1,343,2],[344,0,348,0],[344,1,348,1],[349,0,356,0],[349,1,356,1],[357,0,361,0],[357,1,361,1],[362,0,366,0],[362,1,366,1],[367,0,371,0],[367,1,371,1],[372,1,372,2],[373,0,377,0],[373,1,377,1],[378,0,385,0],[378,1,385,1],[386,0,393,0],[386,1,393,1],[394,1,394,2],[395,0,399,0],[395,1,399,1],[400,0,404,0],[400,1,404,1],[405,0,409,0],[405,1,409,1],[410,0,414,0],[410,1,414,1],[415,0,419,0],[415,1,419,1],[420,0,425,0],[420,1,425,1],[426,0,431,0],[426,1,431,1],[432,0,436,0],[432,1,436,1],[437,0,441,0],[437,1,441,1],[442,1,442,2],[443,1,443,2],[444,0,449,0],[444,1,449,1],[450,0,454,0],[450,1,454,1],[455,0,459,0],[455,1,459,1],[460,0,464,0],[460,1,464,1],[465,0,469,0],[465,1,469,1],[470,0,474,0],[470,1,474,1],[475,0,479,0],[475,1,479,1],[480,0,484,0],[480,1,484,1],[485,0,489,0],[485,1,489,1],[490,1,490,2],[491,0,495,0],[491,1,495,1],[496,0,501,0],[496,1,501,1],[502,0,506,0],[502,1,506,1],[507,0,511,0],[507,1,511,1],[512,0,516,0],[512,1,516,1],[517,0,522,0],[517,1,522,1],[523,0,527,0],[523,1,527,1],[528,0,533,0],[528,1,533,1],[534,0,538,0],[534,1,538,1],[539,1,539,2],[540,0,544,0],[540,1,544,1],[545,0,550,0],[545,1,550,1],[551,0,555,0],[551,1,555,1],[556,0,560,0],[556,1,560,1],[561,0,565,0],[561,1,565,1],[566,0,570,0],[566,1,570,1],[571,0,575,0],[571,1,575,1],[576,0,580,0],[576,1,580,1],[581,0,585,0],[581,1,585,1],[586,1,586,2],[587,0,594,0],[587,1,594,1],[595,0,599,0],[595,1,599,1],[600,0,607,0],[600,1,607,1],[608,0,612,0],[608,1,612,1],[613,0,617,0],[613,1,617,1],[618,0,622,0],[618,1,622,1],[623,0,627,0],[623,1,627,1],[628,0,632,0],[628,1,632,1],[633,0,637,0],[633,1,637,1],[638,1,638,2],[639,0,643,0],[639,1,643,1],[644,0,648,0],[644,1,648,1],[649,0,653,0],[649,1,653,1],[654,0,658,0],[654,1,658,1],[659,0,664,0],[659,1,664,1],[665,0,670,0],[665,1,670,1],[671,0,675,0],[671,1,675,1],[676,0,680,0],[676,1,680,1],[681,0,685,0],[681,1,685,1],[686,1,686,2],[687,0,691,0],[687,1,691,1],[692,0,696,0],[692,1,696,1],[697,0,701,0],[697,1,701,1],[702,0,706,0],[702,1,706,1],[707,0,711,0],[707,1,711,1],[712,0,716,0],[712,1,716,1],[717,0,721,0],[717,1,721,1],[722,1,722,2],[723,0,727,0],[723,1,727,1],[728,0,732,0],[728,1,732,1],[733,0,737,0],[733,1,737,1],[738,0,742,0],[738,1,742,1],[743,0,747,0],[743,1,747,1],[748,0,752,0],[748,1,752,1],[753,0,757,0],[753,1,757,1],[758,0,762,0],[758,1,762,1],[763,0,767,0],[763,1,767,1],[768,1,768,2],[769,0,773,0],[769,1,773,1],[774,0,778,0],[774,1,778,1],[779,0,783,0],[779,1,783,1],[784,0,788,0],[784,1,788,1],[789,0,793,0],[789,1,793,1],[794,1,794,2],[795,0,799,0],[795,1,799,1],[800,0,804,0],[800,1,804,1],[805,0,809,0],[805,1,809,1],[810,0,814,0],[810,1,814,1],[815,0,819,0],[815,1,819,1],[820,0,824,0],[820,1,824,1],[826,0,830,0],[826,1,830,1],[831,0,835,0],[831,1,835,1],[836,1,836,2],[837,1,837,2],[842,0,846,0],[842,1,846,1],[848,0,852,0],[848,1,852,1],[855,1,855,2],[856,0,860,0],[856,1,860,1],[865,1,865,2],[866,0,873,0],[866,1,873,1],[874,0,881,0],[874,1,881,1],[882,0,889,0],[882,1,889,1],[890,0,897,0],[890,1,897,1],[898,0,905,0],[898,1,905,1],[906,0,913,0],[906,1,913,1],[914,0,921,0],[914,1,921,1],[923,0,930,0],[923,1,930,1],[931,1,931,2],[932,0,939,0],[932,1,939,1],[940,0,947,0],[940,1,947,1],[948,0,955,0],[948,1,955,1],[956,0,963,0],[956,1,963,1],[964,0,971,0],[964,1,971,1],[972,0,979,0],[972,1,979,1],[980,0,987,0],[980,1,987,1],[988,0,995,0],[988,1,995,1],[996,1,996,2],[997,0,1001,0],[997,1,1001,1],[1002,0,1006,0],[1002,1,1006,1],[1007,0,1011,0],[1007,1,1011,1],[1012,1,1012,2],[1013,0,1017,0],[1013,1,1017,1],[1020,0,1024,0],[1020,1,1024,1],[1027,0,1031,0],[1027,1,1031,1],[1032,1,1032,2],[1033,0,1037,0],[1033,1,1037,1],[1038,1,1038,2],[1039,0,1043,0],[1039,1,1043,1],[1044,0,1048,0],[1044,1,1048,1],[1049,0,1053,0],[1049,1,1053,1],[1054,0,1058,0],[1054,1,1058,1],[1059,0,1063,0],[1059,1,1063,1],[1064,1,1064,2],[1065,0,1069,0],[1065,1,1069,1],[1070,0,1074,0],[1070,1,1074,1],[1075,0,1079,0],[1075,1,1079,1],[1080,1,1080,2],[1081,1,1081,2],[1082,0,1090,0],[1082,1,1090,1],[1091,0,1099,0],[1091,1,1099,1],[1100,0,1108,0],[1100,1,1108,1],[1109,0,1117,0],[1109,1,1117,1],[1118,0,1126,0],[1118,1,1126,1],[1127,0,1135,0],[1127,1,1135,1],[1136,1,1136,2],[1137,0,1145,0],[1137,1,1145,1],[1146,0,1154,0],[1146,1,1154,1],[1155,0,1162,0],[1155,1,1162,1],[1163,0,1171,0],[1163,1,1171,1],[1172,1,1172,2],[1173,0,1181,0],[1173,1,1181,1],[1182,0,1190,0],[1182,1,1190,1],[1191,1,1191,2],[1192,0,1200,0],[1192,1,1200,1],[1201,0,1209,0],[1201,1,1209,1],[1210,0,1218,0],[1210,1,1218,1],[1219,0,1227,0],[1219,1,1227,1],[1228,0,1236,0],[1228,1,1236,1],[1237,0,1245,0],[1237,1,1245,1],[1246,1,1246,2],[1247,0,1255,0],[1247,1,1255,1],[1256,1,1256,2],[1257,0,1265,0],[1257,1,1265,1],[1266,0,1274,0],[1266,1,1274,1],[1275,0,1283,0],[1275,1,1283,1],[1284,0,1292,0],[1284,1,1292,1],[1293,0,1301,0],[1293,1,1301,1],[1302,0,1310,0],[1302,1,1310,1],[1311,0,1319,0],[1311,1,1319,1],[1320,0,1328,0],[1320,1,1328,1],[1329,1,1329,2],[1330,0,1338,0],[1330,1,1338,1],[1339,0,1347,0],[1339,1,1347,1],[1348,0,1356,0],[1348,1,1356,1],[1357,0,1365,0],[1357,1,1365,1],[1366,0,1374,0],[1366,1,1374,1],[1375,0,1383,0],[1375,1,1383,1],[1384,0,1392,0],[1384,1,1392,1],[1393,0,1401,0],[1393,1,1401,1],[1402,0,1410,0],[1402,1,1410,1],[1411,1,1411,2],[1412,0,1420,0],[1412,1,1420,1],[1421,0,1429,0],[1421,1,1429,1],[1430,0,1438,0],[1430,1,1438,1],[1439,0,1447,0],[1439,1,1447,1],[1448,1,1448,2],[1449,0,1457,0],[1449,1,1457,1],[1458,0,1466,0],[1458,1,1466,1],[1467,0,1475,0],[1467,1,1475,1],[1476,0,1484,0],[1476,1,1484,1],[1485,0,1493,0],[1485,1,1493,1],[1494,0,1502,0],[1494,1,1502,1],[1503,0,1511,0],[1503,1,1511,1],[1512,0,1520,0],[1512,1,1520,1],[1521,0,1529,0],[1521,1,1529,1],[1530,1,1530,2],[1531,1,1531,2],[1532,0,1540,0],[1532,1,1540,1],[1541,0,1549,0],[1541,1,1549,1],[1550,0,1558,0],[1550,1,1558,1],[1559,0,1567,0],[1559,1,1567,1],[1568,0,1576,0],[1568,1,1576,1],[1577,0,1585,0],[1577,1,1585,1],[1586,0,1594,0],[1586,1,1594,1],[1595,0,1603,0],[1595,1,1603,1],[1604,1,1604,2],[1605,0,1613,0],[1605,1,1613,1],[1614,0,1622,0],[1614,1,1622,1],[1623,0,1631,0],[1623,1,1631,1],[1632,0,1640,0],[1632,1,1640,1],[1641,0,1649,0],[1641,1,1649,1],[1650,0,1658,0],[1650,1,1658,1],[1659,0,1667,0],[1659,1,1667,1],[1668,0,1676,0],[1668,1,1676,1],[1677,1,1677,2],[1678,0,1686,0],[1678,1,1686,1],[1687,0,1695,0],[1687,1,1695,1],[1696,1,1696,2],[1697,1,1697,2],[1698,0,1706,0],[1698,1,1706,1],[1708,1,1708,2],[1709,0,1717,0],[1709,1,1717,1],[1720,0,1728,0],[1720,1,1728,1],[1729,0,1737,0],[1729,1,1737,1],[1738,0,1746,0],[1738,1,1746,1],[1747,0,1755,0],[1747,1,1755,1],[1756,0,1764,0],[1756,1,1764,1],[1765,0,1773,0],[1765,1,1773,1],[1774,1,1774,2],[1775,0,1782,0],[1775,1,1782,1],[1783,0,1790,0],[1783,1,1790,1],[1791,0,1798,0],[1791,1,1798,1],[1799,0,1806,0],[1799,1,1806,1],[1807,0,1814,0],[1807,1,1814,1],[1815,0,1822,0],[1815,1,1822,1],[1823,1,1823,2],[1824,0,1831,0],[1824,1,1831,1],[1835,0,1842,0],[1835,1,1842,1],[1843,0,1850,0],[1843,1,1850,1],[1851,0,1858,0],[1851,1,1858,1],[1859,0,1866,0],[1859,1,1866,1],[1867,0,1874,0],[1867,1,1874,1],[1875,1,1875,2],[1876,0,1883,0],[1876,1,1883,1],[1886,0,1893,0],[1886,1,1893,1],[1896,0,1903,0],[1896,1,1903,1],[1905,0,1912,0],[1905,1,1912,1],[1913,1,1913,2],[1914,0,1921,0],[1914,1,1921,1],[1922,0,1929,0],[1922,1,1929,1],[1930,1,1930,2],[1931,0,1938,0],[1931,1,1938,1],[1939,0,1946,0],[1939,1,1946,1],[1947,0,1954,0],[1947,1,1954,1],[1955,1,1955,2],[1956,1,1956,2],[1962,0,1970,0],[1962,1,1970,1],[1971,1,1971,2],[1977,1,1977,2],[1978,0,1986,0],[1978,1,1986,1],[1987,0,1995,0],[1987,1,1995,1],[1996,0,2004,0],[1996,1,2004,1],[2005,1,2005,2],[2006,1,2006,2],[2007,0,2012,0],[2007,1,2012,1],[2013,0,2018,0],[2013,1,2018,1],[2019,0,2024,0],[2019,1,2024,1],[2030,1,2030,2],[2031,0,2036,0],[2031,1,2036,1],[2037,0,2042,0],[2037,1,2042,1],[2043,0,2048,0],[2043,1,2048,1],[2054,1,2054,2],[2055,0,2060,0],[2055,1,2060,1],[2062,1,2062,2],[2063,0,2068,0],[2063,1,2068,1],[2070,1,2070,2],[2071,0,2076,0],[2071,1,2076,1],[2077,1,2077,2],[2080,1,2080,2],[2081,0,2086,0],[2081,1,2086,1],[2087,1,2087,2]]}
["COG","DESCRIPCIÓN",null,"ENERO","FEBRERO","MARZO","ABRIL","MAYO","JUNIO","JULIO","AGOSTO","SEPTIEMBRE","OCTUBRE","NOVIEMBRE","DICIEMBRE","TOTAL"]
[1000,"SERVICIOS PERSONALES",null,{"$f":"D3+D19+D39+D75+D96+D130+D137","v":{"v":123208,"d":"123,208"}},{"v":123208,"d":"123,208"},{"v":135111,"d":"135,111"},{"v":123208,"d":"123,208"},{"v":123208,"d":"123,208"},{"v":123208,"d":"123,208"},{"v":123208,"d":"123,208"},{"v":123208,"d":"123,208"},{"v":123208,"d":"123,208"},{"v":123208,"d":"123,208"},{"v":123208,"d":"123,208"},{"v":123208,"d":"123,208"},{"v":1490399,"d":"1,490,399"}]
[1100,"REMUNERACIONES AL PERSONAL DE CARÁCTER PERMANENTE",null,{"$f":"SUM(D4:D18)","v":{"v":98336,"d":"98,336"}},{"$f":"SUM(E4:E18)","v":{"v":98336,"d":"98,336"}},{"v":98336,"d":"98,336"},{"v":98336,"d":"98,336"},{"v":98336,"d":"98,336"},{"v":98336,"d":"98,336"},{"v":98336,"d":"98,336"},{"v":98336,"d":"98,336"},{"v":98336,"d":"98,336"},{"v":98336,"d":"98,336"},{"v":98336,"d":"98,336"},{"v":98336,"d":"98,336"},{"$f":"SUM(P4:P18)","v":{"v":1180032,"d":"1,180,032"}}]
[111,"Dietas",11,{"$f":"(SUMIF(Plantilla!$E$3:$E$4,C4,Plantilla!$H$3:$H$4))/12","v":0},{"$f":"D4","v":0},{"$f":"E4","v":0},0,0,0,0,0,0,0,0,0,{"$f":"SUM(D4:O4)","v":0}]
[null,null,15,{"$f":"(SUMIF(Plantilla!$E$3:$E$4,C5,Plantilla!$H$3:$H$4))/12","v":0},{"$f":"D5","v":0},0,0,0,0,0,0,0,0,0,0,{"$f":"SUM(D5:O5)","v":0}]
[null,null,16,{"$f":"(SUMIF(Plantilla!$E$3:$E$4,C6,Plantilla!$H$3:$H$4))/12","v":0},{"$f":"D6","v":0},0,0,0,0,0,0,0,0,0,0,0]
[null,null,17,{"$f":"(SUMIF(Plantilla!$E$3:$E$4,C7,Plantilla!$H$3:$H$4))/12","v":0},{"$f":"D7","v":0},0,0,0,0,0,0,0,0,0,0,0]
[112,"Haberes",{"$nulls":13},{"$f":"SUM(D8:O8)","v":0}]
[113,"Sueldos base al personal permanente",11,{"$f":"(SUMIF(Plantilla!$E$5:$E$428,'COG-M'!C9,Plantilla!$H$5:$H$428))/12","v":{"v":98336,"d":"98,336"}},{"$f":"D9","v":{"v":98336,"d":"98,336"}},{"$f":"E9","v":{"v":98336,"d":"98,336"}},{"v":98336,"d":"98,336"},{"v":98336,"d":"98,336"},{"v":98336,"d":"98,336"},{"v":98336,"d":"98,336"},{"v":98336,"d":"98,336"},{"v":98336,"d":"98,336"},{"v":98336,"d":"98,336"},{"v":98336,"d":"98,336"},{"v":98336,"d":"98,336"},{"$f":"SUM(D9:O9)","v":{"v":1180032,"d":"1,180,032"}}]
[null,null,14,{"$f":"(SUMIF(Plantilla!$E$5:$E$428,'COG-M'!C10,Plantilla!$H$5:$H$428))/12","v":0},{"$f":"D10","v":0},0,0,0,0,0,0,0,0,0,0,{"$f":"SUM(D10:O10)","v":0}]
[null,null,15,{"$f":"(SUMIF(Plantilla!$E$5:$E$428,'COG-M'!C11,Plantilla!$H$5:$H$428))/12","v":0},{"$f":"D11","v":0},0,0,0,0,0,0,0,0,0,0,0]
[null,null,16,{"$f":"(SUMIF(Plantilla!$E$5:$E$428,'COG-M'!C12,Plantilla!$H$5:$H$428))/12","v":0},{"$f":"D12","v":0},0,0,0,0,0,0,0,0,0,0,0]
[null,null,17,{"$f":"(SUMIF(Plantilla!$E$5:$E$428,'COG-M'!C13,Plantilla!$H$5:$H$428))/12","v":0},{"$f":"D13","v":0},0,0,0,0,0,0,0,0,0,0,0]
[null,null,25,{"$f":"(SUMIF(Plantilla!$E$5:$E$428,'COG-M'!C14,Plantilla!$H$5:$H$428))/12","v":0},{"$f":"D14","v":0},0,0,0,0,0,0,0,0,0,0,0]
[114,"Remuneraciones por adscripción laboral en el extranjero",11,{"$nulls":12},{"$f":"SUM(D15:O15)","v":0}]
[null,null,15,{"$nulls":12},{"$f":"SUM(D16:O16)","v":0}]
[null,null,16,{"$nulls":12},0]
[null,null,17,{"$nulls":12},0]
[1200,"REMUNERACIONES AL PERSONAL DE CARÁCTER TRANSITORIO",null,{"$f":"SUM(D20:D38)","v":0},{"$f":"SUM(E20:E38)","v":0},{"v":11903,"d":"11,903"},0,0,0,0,0,0,0,0,0,{"$f":"SUM(P20:P38)","v":{"v":11903,"d":"11,903"}}]
[121,"Honorarios asimilables a salarios",11,{"$nulls":12},{"$f":"SUM(D20:O20)","v":0}]
[null,null,14,{"$nulls":12},{"$f":"SUM(D21:O21)","v":0}]
[null,null,15,{"$nulls":12},0]
[null,null,16,{"$nulls":12},0]
[null,null,17,{"$nulls":12},0]
[122,"Sueldos base al personal eventual",11,null,null,{"v":11903,"d":"11,903"},{"$nulls":9},{"v":11903,"d":"11,903"}]
[null,null,14,{"$nulls":12},0]
[null,null,15,{"$nulls":12},0]
[null,null,16,{"$nulls":12},0]
[null,null,17,{"$nulls":12},0]
[null,null,25,{"$nulls":12},0]
[null,null,26,{"$nulls":12},0]
[null,null,27,{"$nulls":12},0]
[123,"Retribuciones por servicios de carácter social",11,{"$nulls":12},0]
[null,null,14,{"$nulls":12},0]
[null,null,15,{"$nulls":12},0]
[null,null,16,{"$nulls":12},0]
[null,null,17,{"$nulls":12},0]
[124,"Retribución a los representantes de los trabajadores y de los patrones en la Junta de Conciliación y Arbitraje",{"$nulls":13},{"$f":"SUM(D38:O38)","v":0}]
[1300,"REMUNERACIONES ADICIONALES Y ESPECIALES",null,{"$f":"SUM(D40:D74)","v":{"v":14826,"d":"14,826"}},{"$f":"SUM(E40:E74)","v":{"v":14826,"d":"14,826"}},{"v":14826,"d":"14,826"},{"v":14826,"d":"14,826"},{"v":14826,"d":"14,826"},{"v":14826,"d":"14,826"},{"v":14826,"d":"14,826"},{"v":14826,"d":"14,826"},{"v":14826,"d":"14,826"},{"v":14826,"d":"14,826"},{"v":14826,"d":"14,826"},{"v":14826,"d":"14,826"},{"v":177912,"d":"177,912"}]
[131,"Primas por años de servicios efectivos prestados",11,{"$nulls":12},{"$f":"SUM(D40:O40)","v":0}]
[null,null,14,{"$nulls":12},0]
[null,null,15,{"$nulls":12},0]
[null,null,16,{"$nulls":12},0]
[null,null,17,{"$nulls":12},0]
[132,"Primas de vacaciones, dominical y gratificación de fin de año",11,{"v":14826,"d":"14,826"},{"v":14826,"d":"14,826"},{"v":14826,"d":"14,826"},{"v":14826,"d":"14,826"},{"v":14826,"d":"14,826"},{"v":14826,"d":"14,826"},{"v":14826,"d":"14,826"},{"v":14826,"d":"14,826"},{"v":14826,"d":"14,826"},{"v":14826,"d":"14,826"},{"v":14826,"d":"14,826"},{"v":14826,"d":"14,826"},{"v":177912,"d":"177,912"}]
[null,null,14,{"$nulls":12},{"$f":"SUM(D46:O46)","v":0}]
[null,null,15,{"$nulls":12},{"$f":"SUM(D47:O47)","v":0}]
[null,null,16,{"$nulls":12},0]
[null,null,17,{"$nulls":12},0]
[null,null,25,{"$nulls":12},0]
[133,"Horas extraordinarias",11,{"$nulls":12},0]
[null,null,14,{"$nulls":12},0]
[null,null,15,{"$nulls":12},0]
[null,null,16,{"$nulls":12},0]
[null,null,17,{"$nulls":12},0]
[null,null,25,{"$nulls":12},0]
[134,"Compensaciones",11,{"$nulls":12},0]
[null,null,14,{"$nulls":12},0]
[null,null,15,{"$nulls":12},0]
[null,null,16,{"$nulls":12},0]
[null,null,17,{"$nulls":12},0]
[null,null,25,{"$nulls":12},0]
[135,"Sobrehaberes",{"$nulls":13},0]
[136,"Asignaciones de técnico, de mando, por comisión, de vuelo y de técnico especial",{"$nulls":13},0]
[137,"Honorarios especiales",11,{"$nulls":12},0]
[null,null,14,{"$nulls":12},0]
[null,null,15,{"$nulls":12},0]
[null,null,16,{"$nulls":12},0]
[null,null,17,{"$nulls":12},0]
[138,"Participaciones por vigilancia en el cumplimiento de la leyes y custodia de valores",11,{"$nulls":12},0]
[null,null,14,{"$nulls":12},0]
[null,null,15,{"$nulls":12},0]
[null,null,16,{"$nulls":12},0]
[null,null,17,{"$nulls":12},0]
[1400,"SEGURIDAD SOCIAL",null,{"$f":"SUM(D76:D95)","v":{"v":7250,"d":"7,250"}},{"$f":"SUM(E76:E95)","v":{"v":7250,"d":"7,250"}},{"v":7250,"d":"7,250"},{"v":7250,"d":"7,250"},{"v":7250,"d":"7,250"},{"v":7250,"d":"7,250"},{"v":7250,"d":"7,250"},{"v":7250,"d":"7,250"},{"v":7250,"d":"7,250"},{"v":7250,"d":"7,250"},{"v":7250,"d":"7,250"},{"v":7250,"d":"7,250"},{"v":87000,"d":"87,000"}]
[141,"Aportaciones de seguridad social",11,{"v":7250,"d":"7,250"},{"v":7250,"d":"7,250"},{"v":7250,"d":"7,250"},{"v":7250,"d":"7,250"},{"v":7250,"d":"7,250"},{"v":7250,"d":"7,250"},{"v":7250,"d":"7,250"},{"v":7250,"d":"7,250"},{"v":7250,"d":"7,250"},{"v":7250,"d":"7,250"},{"v":7250,"d":"7,250"},{"v":7250,"d":"7,250"},{"$f":"SUM(D76:O76)","v":{"v":87000,"d":"87,000"}}]
[null,null,14,{"$nulls":12},{"$f":"SUM(D77:O77)","v":0}]
[null,null,15,{"$nulls":12},0]
[null,null,16,{"$nulls":12},0]
[null,null,17,{"$nulls":12},0]
[142,"Aportaciones a fondos de vivienda",11,{"$nulls":12},0]
[null,null,14,{"$nulls":12},0]
[null,null,15,{"$nulls":12},0]
[null,null,16,{"$nulls":12},0]
[null,null,17,{"$nulls":12},0]
[143,"Aportaciones al sistema para el retiro",11,{"$nulls":12},0]
[null,null,14,{"$nulls":12},0]
[null,null,15,{"$nulls":12},0]
[null,null,16,{"$nulls":12},0]
[null,null,17,{"$nulls":12},0]
[144,"Aportaciones para seguros",11,{"$nulls":12},0]
[null,null,14,{"$nulls":12},0]
[null,null,15,{"$nulls":12},0]
[null,null,16,{"$nulls":12},0]
[null,null,17,{"$nulls":12},0]
[1500,"OTRAS PRESTACIONES SOCIALES Y ECONÓMICAS",null,{"$f":"SUM(D97:D129)","v":0},{"$f":"SUM(E97:E129)","v":0},0,0,0,0,0,0,0,0,0,0,0]
[151,"Cuotas para el fondo de ahorro y fondo de trabajo",11,{"$nulls":12},{"$f":"SUM(D97:O97)","v":0}]
[null,null,14,{"$nulls":12},0]
[null,null,15,{"$nulls":12},0]
[null,null,16,{"$nulls":12},0]
[null,null,17,{"$nulls":12},0]
[null,null,25,{"$nulls":12},0]
[152,"Indemnizaciones",11,{"$nulls":12},0]
[null,null,14,{"$nulls":12},0]
[null,null,15,{"$nulls":12},0]
[null,null,16,{"$nulls":12},0]
[null,null,17,{"$nulls":12},0]
[null,null,27,{"$nulls":12},0]
[153,"Prestaciones y haberes de retiro",11,{"$nulls":12},0]
[null,null,14,{"$nulls":12},0]
[null,null,15,{"$nulls":12},0]
[null,null,16,{"$nulls":12},0]
[null,null,17,{"$nulls":12},0]
[154,"Prestaciones contractuales",11,{"$nulls":12},0]
[null,null,14,{"$nulls":12},0]
[null,null,15,{"$nulls":12},0]
[null,null,16,{"$nulls":12},0]
[null,null,17,{"$nulls":12},0]
[null,null,25,{"$nulls":12},0]
[155,"Apoyos a la capacitación de los servidores públicos",11,{"$nulls":12},0]
[null,null,14,{"$nulls":12},0]
[null,null,15,{"$nulls":12},0]
[null,null,16,{"$nulls":12},0]
[null,null,17,{"$nulls":12},0]
[159,"Otras prestaciones sociales y económicas",11,{"$nulls":12},0]
[null,null,14,{"$nulls":12},0]
[null,null,15,{"$nulls":12},0]
[null,null,16,{"$nulls":12},0]
[null,null,17,{"$nulls":12},0]
[1600,"PREVISIONES",null,{"$f":"SUM(D131:D136)","v":{"v":2796,"d":"2,796"}},{"$f":"SUM(E131:E136)","v":{"v":2796,"d":"2,796"}},{"v":2796,"d":"2,796"},{"v":2796,"d":"2,796"},{"v":2796,"d":"2,796"},{"v":2796,"d":"2,796"},{"v":2796,"d":"2,796"},{"v":2796,"d":"2,796"},{"v":2796,"d":"2,796"},{"v":2796,"d":"2,796"},{"v":2796,"d":"2,796"},{"v":2796,"d":"2,796"},{"v":33552,"d":"33,552"}]
[161,"Previsiones de carácter laboral, económica y de seguridad social",11,{"v":2796,"d":"2,796"},{"v":2796,"d":"2,796"},{"v":2796,"d":"2,796"},{"v":2796,"d":"2,796"},{"v":2796,"d":"2,796"},{"v":2796,"d":"2,796"},{"v":2796,"d":"2,796"},{"v":2796,"d":"2,796"},{"v":2796,"d":"2,796"},{"v":2796,"d":"2,796"},{"v":2796,"d":"2,796"},{"v":2796,"d":"2,796"},{"$f":"SUM(D131:O131)","v":{"v":33552,"d":"33,552"}}]
[null,null,14,{"$nulls":12},{"$f":"SUM(D132:O132)","v":0}]
[null,null,15,{"$nulls":12},0]
[null,null,16,{"$nulls":12},0]
[null,null,17,{"$nulls":12},0]
[null,null,25,{"$nulls":12},0]
[1700,"PAGO DE ESTÍMULOS A SERVIDORES PÚBLICOS",null,{"$f":"SUM(D138:D147)","v":0},{"$f":"SUM(E138:E147)","v":0},0,0,0,0,0,0,0,0,0,0,0]
[171,"Estímulos",11,{"$nulls":12},{"$f":"SUM(D138:O138)","v":0}]
[null,null,14,{"$nulls":12},{"$f":"SUM(D139:O139)","v":0}]
[null,null,15,{"$nulls":12},0]
[null,null,16,{"$nulls":12},0]
[null,null,17,{"$nulls":12},0]
[172,"Recompensas",11,{"$nulls":12},0]
[null,null,14,{"$nulls":12},0]
[null,null,15,{"$nulls":12},0]
[null,null,16,{"$nulls":12},0]
[null,null,17,{"$nulls":12},0]
[2000,"MATERIALES Y SUMINISTROS",null,{"$f":"D149+D190+D207+D217+D290+D332+D344+D373+D395","v":{"v":30844,"d":"30,844"}},{"v":30844,"d":"30,844"},{"v":30844,"d":"30,844"},{"v":30844,"d":"30,844"},{"v":30844,"d":"30,844"},{"v":30844,"d":"30,844"},{"v":30844,"d":"30,844"},{"v":30844,"d":"30,844"},{"v":30844,"d":"30,844"},{"v":30844,"d":"30,844"},{"v":30844,"d":"30,844"},{"v":30844,"d":"30,844"},{"v":370128,"d":"370,128"}]
[2100,"MATERIALES DE ADMINISTRACIÓN, EMISIÓN DE DOCUMENTOS Y ARTÍCULOS OFICIALES",null,{"$f":"SUM(D150:D189)","v":{"v":3570,"d":"3,570"}},{"v":3570,"d":"3,570"},{"v":3570,"d":"3,570"},{"v":3570,"d":"3,570"},{"v":3570,"d":"3,570"},{"v":3570,"d":"3,570"},{"v":3570,"d":"3,570"},{"v":3570,"d":"3,570"},{"v":3570,"d":"3,570"},{"v":3570,"d":"3,570"},{"v":3570,"d":"3,570"},{"v":3570,"d":"3,570"},{"v":42840,"d":"42,840"}]
[211,"Materiales, útiles y equipos menores de oficina",11,{"v":2380,"d":"2,380"},{"v":2380,"d":"2,380"},{"v":2380,"d":"2,380"},{"v":2380,"d":"2,380"},{"v":2380,"d":"2,380"},{"v":2380,"d":"2,380"},{"v":2380,"d":"2,380"},{"v":2380,"d":"2,380"},{"v":2380,"d":"2,380"},{"v":2380,"d":"2,380"},{"v":2380,"d":"2,380"},{"v":2380,"d":"2,380"},{"$f":"SUM(D150:O150)","v":{"v":28560,"d":"28,560"}}]
[null,null,14,{"$nulls":12},{"$f":"SUM(D151:O151)","v":0}]
[null,null,15,{"$nulls":12},0]
[null,null,16,{"$nulls":12},0]
[null,null,17,{"$nulls":12},0]
[212,"Materiales y útiles de impresión y reproducción",11,595,595,595,595,595,595,595,595,595,595,595,595,{"$f":"SUM(D155:O155)","v":{"v":7140,"d":"7,140"}}]
[null,null,14,{"$nulls":12},{"$f":"SUM(D156:O156)","v":0}]
[null,null,15,{"$nulls":12},0]
[null,null,16,{"$nulls":12},0]
[null,null,17,{"$nulls":12},0]
[213,"Material estadístico y geográfico",11,{"$nulls":12},0]
[null,null,14,{"$nulls":12},0]
[null,null,15,{"$nulls":12},0]
[null,null,16,{"$nulls":12},0]
[null,null,17,{"$nulls":12},0]
[214,"Materiales, útiles y equipos menores de tecnologías de la información y comunicaciones",11,{"$nulls":12},0]
[null,null,14,{"$nulls":12},0]
[null,null,15,{"$nulls":12},0]
[null,null,16,{"$nulls":12},0]
[null,null,17,{"$nulls":12},0]
[215,"Material impreso e información digital",11,{"$nulls":12},0]
[null,null,14,{"$nulls":12},0]
[null,null,15,{"$nulls":12},0]
[null,null,16,{"$nulls":12},0]
[null,null,17,{"$nulls":12},0]
[216,"Material de limpieza",11,595,595,595,595,595,595,595,595,595,595,595,595,{"v":7140,"d":"7,140"}]
[null,null,14,{"$nulls":12},0]
[null,null,15,{"$nulls":12},0]
[null,null,16,{"$nulls":12},0]
[null,null,17,{"$nulls":12},0]
[217,"Materiales y útiles de enseñanza",11,{"$nulls":12},0]
[null,null,14,{"$nulls":12},0]
[null,null,15,{"$nulls":12},0]
[null,null,16,{"$nulls":12},0]
[null,null,17,{"$nulls":12},0]
[218,"Materiales para el registro e identificación de bienes y personas",11,{"$nulls":12},0]
[null,null,14,{"$nulls":12},0]
[null,null,15,{"$nulls":12},0]
[null,null,16,{"$nulls":12},0]
[null,null,17,{"$nulls":12},0]
[2200,"ALIMENTOS Y UTENSILIOS",null,{"$f":"SUM(D191:D206)","v":{"v":11616,"d":"11,616"}},{"v":11616,"d":"11,616"},{"v":11616,"d":"11,616"},{"v":11616,"d":"11,616"},{"v":11616,"d":"11,616"},{"v":11616,"d":"11,616"},{"v":11616,"d":"11,616"},{"v":11616,"d":"11,616"},{"v":11616,"d":"11,616"},{"v":11616,"d":"11,616"},{"v":11616,"d":"11,616"},{"v":11616,"d":"11,616"},{"v":139392,"d":"139,392"}]
[221,"Productos alimenticios para personas",11,{"v":11021,"d":"11,021"},{"v":11021,"d":"11,021"},{"v":11021,"d":"11,021"},{"v":11021,"d":"11,021"},{"v":11021,"d":"11,021"},{"v":11021,"d":"11,021"},{"v":11021,"d":"11,021"},{"v":11021,"d":"11,021"},{"v":11021,"d":"11,021"},{"v":11021,"d":"11,021"},{"v":11021,"d":"11,021"},{"v":11021,"d":"11,021"},{"$f":"SUM(D191:O191)","v":{"v":132252,"d":"132,252"}}]
[null,null,14,{"$nulls":12},{"$f":"SUM(D192:O192)","v":0}]
[null,null,15,{"$nulls":12},0]
[null,null,16,{"$nulls":12},0]
[null,null,17,{"$nulls":12},0]
[null,null,25,{"$nulls":12},0]
[222,"Productos alimenticios para animales",11,{"$nulls":12},0]
[null,null,14,{"$nulls":12},0]
[null,null,15,{"$nulls":12},0]
[null,null,16,{"$nulls":12},0]
[null,null,17,{"$nulls":12},0]
[223,"Utensilios para el servicio de alimentación",11,595,595,595,595,595,595,595,595,595,595,595,595,{"v":7140,"d":"7,140"}]
[null,null,14,{"$nulls":12},0]
[null,null,15,{"$nulls":12},0]
[null,null,16,{"$nulls":12},0]
[null,null,17,{"$nulls":12},0]
[2300,"MATERIAS PRIMAS Y MATERIALES DE PRODUCCIÓN Y COMERCIALIZACIÓN",null,{"$f":"SUM(D208:D216)","v":0},0,0,0,0,0,0,0,0,0,0,0,0]
[231,"Productos alimenticios, agropecuarios y forestales adquiridos como materia prima",{"$nulls":13},{"$f":"SUM(D208:O208)","v":0}]
[232,"Insumos textiles adquiridos como materia prima",{"$nulls":13},0]
[233,"Productos de papel, cartón e impresos adquiridos como materia prima",{"$nulls":13},0]
[234,"Combustibles, lubricantes, aditivos, carbón y sus derivados adquiridos como materia prima",{"$nulls":13},0]
[235,"Productos químicos, farmacéuticos y de laboratorio adquiridos como materia prima",{"$nulls":13},0]
[236,"Productos metálicos y a base de minerales no metálicos adquiridos como materia prima",{"$nulls":13},0]
[237,"Productos de cuero, piel, plástico y hule adquiridos como materia prima",{"$nulls":13},0]
[238,"Mercancías adquiridas para su comercialización",{"$nulls":13},0]
[239,"Otros productos adquiridos como materia prima",{"$nulls":13},0]
[2400,"MATERIALES Y ARTÍCULOS DE CONSTRUCCIÓN Y DE REPARACIÓN",null,{"$f":"SUM(D218:D289)","v":0},{"$f":"SUM(E218:E289)","v":0},0,0,0,0,0,0,0,0,0,0,0]
[241,"Productos minerales no metálicos",11,{"$nulls":12},{"$f":"SUM(D218:O218)","v":0}]
[null,null,14,{"$nulls":12},{"$f":"SUM(D219:O219)","v":0}]
[null,null,15,{"$nulls":12},0]
[null,null,16,{"$nulls":12},0]
[null,null,17,{"$nulls":12},0]
[null,null,25,{"$nulls":12},0]
[null,null,26,{"$nulls":12},0]
[null,null,27,{"$nulls":12},0]
[242,"Cemento y productos de concreto",11,{"$nulls":12},0]
[null,null,14,{"$nulls":12},0]
[null,null,15,{"$nulls":12},0]
[null,null,16,{"$nulls":12},0]
[null,null,17,{"$nulls":12},0]
[null,null,25,{"$nulls":12},0]
[null,null,26,{"$nulls":12},0]
[null,null,27,{"$nulls":12},0]
[243,"Cal, yeso y productos de yeso",11,{"$nulls":12},0]
[null,null,14,{"$nulls":12},0]
[null,null,15,{"$nulls":12},0]
[null,null,16,{"$nulls":12},0]
[null,null,17,{"$nulls":12},0]
[null,null,25,{"$nulls":12},0]
[null,null,26,{"$nulls":12},0]
[null,null,27,{"$nulls":12},0]
[244,"Madera y productos de madera",11,{"$nulls":12},0]
[null,null,14,{"$nulls":12},0]
[null,null,15,{"$nulls":12},0]
[null,null,16,{"$nulls":12},0]
[null,null,17,{"$nulls":12},0]
[null,null,25,{"$nulls":12},0]
[null,null,26,{"$nulls":12},0]
[null,null,27,{"$nulls":12},0]
[245,"Vidrio y productos de vidrio",11,{"$nulls":12},0]
[null,null,14,{"$nulls":12},0]
[null,null,15,{"$nulls":12},0]
[null,null,16,{"$nulls":12},0]
[null,null,17,{"$nulls":12},0]
[null,null,25,{"$nulls":12},0]
[null,null,26,{"$nulls":12},0]
[null,null,27,{"$nulls":12},0]
[246,"Material eléctrico y electrónico",11,{"$nulls":12},0]
[null,null,14,{"$nulls":12},0]
[null,null,15,{"$nulls":12},0]
[null,null,16,{"$nulls":12},0]
[null,null,17,{"$nulls":12},0]
[null,null,25,{"$nulls":12},0]
[null,null,26,{"$nulls":12},0]
[null,null,27,{"$nulls":12},0]
[247,"Artículos metálicos para la construcción",11,{"$nulls":12},0]
[null,null,14,{"$nulls":12},0]
[null,null,15,{"$nulls":12},0]
[null,null,16,{"$nulls":12},0]
[null,null,17,{"$nulls":12},0]
[null,null,25,{"$nulls":12},0]
[null,null,26,{"$nulls":12},0]
[null,null,27,{"$nulls":12},0]
[248,"Materiales complementarios",11,{"$nulls":12},0]
[null,null,14,{"$nulls":12},0]
[null,null,15,{"$nulls":12},0]
[null,null,16,{"$nulls":12},0]
[null,null,17,{"$nulls":12},0]
[null,null,25,{"$nulls":12},0]
[null,null,26,{"$nulls":12},0]
[null,null,27,{"$nulls":12},0]
[249,"Otros materiales y artículos de construcción y reparación",11,{"$nulls":12},0]
[null,null,14,{"$nulls":12},{"$f":"SUM(D283:O283)","v":0}]
[null,null,15,{"$nulls":12},0]
[null,null,16,{"$nulls":12},0]
[null,null,17,{"$nulls":12},0]
[null,null,25,{"$nulls":12},0]
[null,null,26,{"$nulls":12},0]
[null,null,27,{"$nulls":12},0]
[2500,"PRODUCTOS QUÍMICOS, FARMACÉUTICOS Y DE LABORATORIO",null,{"$f":"SUM(D291:D331)","v":0},0,0,0,0,0,0,0,0,0,0,0,0]
[251,"Productos químicos básicos",11,{"$nulls":12},{"$f":"SUM(D291:O291)","v":0}]
[null,null,14,{"$nulls":12},{"$f":"SUM(D292:O292)","v":0}]
[null,null,15,{"$nulls":12},0]
[null,null,16,{"$nulls":12},0]
[null,null,17,{"$nulls":12},0]
[252,"Fertilizantes, pesticidas y otros agroquímicos",11,{"$nulls":12},0]
[null,null,14,{"$nulls":12},0]
[null,null,15,{"$nulls":12},0]
[null,null,16,{"$nulls":12},0]
[null,null,17,{"$nulls":12},0]
[253,"Medicinas y productos farmacéuticos",11,{"$nulls":12},0]
[null,null,14,{"$nulls":12},0]
[null,null,15,{"$nulls":12},0]
[null,null,16,{"$nulls":12},0]
[null,null,17,{"$nulls":12},0]
[null,null,25,{"$nulls":12},0]
[null,null,26,{"$nulls":12},0]
[null,null,27,{"$nulls":12},0]
[254,"Materiales, accesorios y suministros médicos",11,{"$nulls":12},0]
[null,null,14,{"$nulls":12},0]
[null,null,15,{"$nulls":12},0]
[null,null,16,{"$nulls":12},0]
[null,null,17,{"$nulls":12},0]
[255,"Materiales, accesorios y suministros de laboratorio",11,{"$nulls":12},0]
[null,null,14,{"$nulls":12},0]
[null,null,15,{"$nulls":12},0]
[null,null,16,{"$nulls":12},0]
[null,null,17,{"$nulls":12},0]
[null,null,25,{"$nulls":12},0]
[null,null,26,{"$nulls":12},0]
[null,null,27,{"$nulls":12},0]
[256,"Fibras sintéticas, hules plásticos y derivados",11,{"$nulls":12},0]
[null,null,14,{"$nulls":12},0]
[null,null,15,{"$nulls":12},0]
[null,null,16,{"$nulls":12},0]
[null,null,17,{"$nulls":12},0]
[259,"Otros productos químicos",11,{"$nulls":12},0]
[null,null,14,{"$nulls":12},0]
[null,null,15,{"$nulls":12},0]
[null,null,16,{"$nulls":12},0]
[null,null,17,{"$nulls":12},0]
[2600,"COMBUSTIBLES, LUBRICANTES Y ADITIVOS",null,{"$f":"SUM(D333:D343)","v":{"v":13306,"d":"13,306"}},{"v":13306,"d":"13,306"},{"v":13306,"d":"13,306"},{"v":13306,"d":"13,306"},{"v":13306,"d":"13,306"},{"v":13306,"d":"13,306"},{"v":13306,"d":"13,306"},{"v":13306,"d":"13,306"},{"v":13306,"d":"13,306"},{"v":13306,"d":"13,306"},{"v":13306,"d":"13,306"},{"v":13306,"d":"13,306"},{"v":159672,"d":"159,672"}]
[261,"Combustibles, lubricantes y aditivos",11,{"v":13306,"d":"13,306"},{"v":13306,"d":"13,306"},{"v":13306,"d":"13,306"},{"v":13306,"d":"13,306"},{"v":13306,"d":"13,306"},{"v":13306,"d":"13,306"},{"v":13306,"d":"13,306"},{"v":13306,"d":"13,306"},{"v":13306,"d":"13,306"},{"v":13306,"d":"13,306"},{"v":13306,"d":"13,306"},{"v":13306,"d":"13,306"},{"$f":"SUM(D333:O333)","v":{"v":159672,"d":"159,672"}}]
[null,null,14,{"$nulls":12},{"$f":"SUM(D334:O334)","v":0}]
[null,null,15,{"$nulls":12},0]
[null,null,16,{"$nulls":12},0]
[null,null,17,{"$nulls":12},0]
[null,null,25,{"$nulls":12},0]
[262,"Carbón y sus derivados",11,{"$nulls":12},0]
[null,null,14,{"$nulls":12},0]
[null,null,15,{"$nulls":12},0]
[null,null,16,{"$nulls":12},0]
[null,null,17,{"$nulls":12},0]
[2700,"VESTUARIO, BLANCOS, PRENDAS DE PROTECCIÓN Y ARTÍCULOS DEPORTIVOS",null,{"$f":"SUM(D345:D372)","v":{"v":1189,"d":"1,189"}},{"v":1189,"d":"1,189"},{"v":1189,"d":"1,189"},{"v":1189,"d":"1,189"},{"v":1189,"d":"1,189"},{"v":1189,"d":"1,189"},{"v":1189,"d":"1,189"},{"v":1189,"d":"1,189"},{"v":1189,"d":"1,189"},{"v":1189,"d":"1,189"},{"v":1189,"d":"1,189"},{"v":1189,"d":"1,189"},{"v":14268,"d":"14,268"}]
[271,"Vestuario y uniformes",11,{"v":1189,"d":"1,189"},{"v":1189,"d":"1,189"},{"v":1189,"d":"1,189"},{"v":1189,"d":"1,189"},{"v":1189,"d":"1,189"},{"v":1189,"d":"1,189"},{"v":1189,"d":"1,189"},{"v":1189,"d":"1,189"},{"v":1189,"d":"1,189"},{"v":1189,"d":"1,189"},{"v":1189,"d":"1,189"},{"v":1189,"d":"1,189"},{"$f":"SUM(D345:O345)","v":{"v":14268,"d":"14,268"}}]
[null,null,14,{"$nulls":12},{"$f":"SUM(D346:O346)","v":0}]
[null,null,15,{"$nulls":12},0]
[null,null,16,{"$nulls":12},0]
[null,null,17,{"$nulls":12},0]
[272,"Prendas de seguridad y protección personal",11,{"$nulls":12},0]
[null,null,14,{"$nulls":12},0]
[null,null,15,{"$nulls":12},0]
[null,null,16,{"$nulls":12},0]
[null,null,17,{"$nulls":12},0]
[null,null,25,{"$nulls":12},0]
[null,null,26,{"$nulls":12},0]
[null,null,27,{"$nulls":12},0]
[273,"Artículos deportivos",11,{"$nulls":12},0]
[null,null,14,{"$nulls":12},0]
[null,null,15,{"$nulls":12},0]
[null,null,16,{"$nulls":12},0]
[null,null,17,{"$nulls":12},0]
[274,"Productos textiles",11,{"$nulls":12},0]
[null,null,14,{"$nulls":12},0]
[null,null,15,{"$nulls":12},0]
[null,null,16,{"$nulls":12},0]
[null,null,17,{"$nulls":12},0]
[275,"Blancos y otros productos textiles, excepto prendas de vestir",11,{"$nulls":12},0]
[null,null,14,{"$nulls":12},0]
[null,null,15,{"$nulls":12},0]
[null,null,16,{"$nulls":12},0]
[null,null,17,{"$nulls":12},0]
[2800,"MATERIALES Y SUMINISTROS PARA SEGURIDAD",null,{"$f":"SUM(D374:D394)","v":0},0,0,0,0,0,0,0,0,0,0,0,0]
[281,"Sustancias y materiales explosivos",11,{"$nulls":12},{"$f":"SUM(D374:O374)","v":0}]
[null,null,14,{"$nulls":12},{"$f":"SUM(D375:O375)","v":0}]
[null,null,15,{"$nulls":12},0]
[null,null,16,{"$nulls":12},0]
[null,null,17,{"$nulls":12},0]
[282,"Materiales de seguridad pública",11,{"$nulls":12},0]
[null,null,14,{"$nulls":12},0]
[null,null,15,{"$nulls":12},0]
[null,null,16,{"$nulls":12},0]
[null,null,17,{"$nulls":12},0]
[null,null,25,{"$nulls":12},0]
[null,null,26,{"$nulls":12},0]
[null,null,27,{"$nulls":12},0]
[283,"Prendas de protección para seguridad pública y nacional",11,{"$nulls":12},0]
[null,null,14,{"$nulls":12},0]
[null,null,15,{"$nulls":12},0]
[null,null,16,{"$nulls":12},0]
[null,null,17,{"$nulls":12},0]
[null,null,25,{"$nulls":12},0]
[null,null,26,{"$nulls":12},0]
[null,null,27,{"$nulls":12},0]
[2900,"HERRAMIENTAS, REFACCIONES Y ACCESORIOS MENORES",null,{"$f":"SUM(D396:D442)","v":{"v":1163,"d":"1,163"}},{"v":1163,"d":"1,163"},{"v":1163,"d":"1,163"},{"v":1163,"d":"1,163"},{"v":1163,"d":"1,163"},{"v":1163,"d":"1,163"},{"v":1163,"d":"1,163"},{"v":1163,"d":"1,163"},{"v":1163,"d":"1,163"},{"v":1163,"d":"1,163"},{"v":1163,"d":"1,163"},{"v":1163,"d":"1,163"},{"v":13956,"d":"13,956"}]
[291,"Herramientas menores",11,{"$nulls":12},{"$f":"SUM(D396:O396)","v":0}]
[null,null,14,{"$nulls":12},{"$f":"SUM(D397:O397)","v":0}]
[null,null,15,{"$nulls":12},0]
[null,null,16,{"$nulls":12},0]
[null,null,17,{"$nulls":12},0]
[292,"Refacciones y accesorios menores de edificios",11,{"$nulls":12},0]
[null,null,14,{"$nulls":12},0]
[null,null,15,{"$nulls":12},0]
[null,null,16,{"$nulls":12},0]
[null,null,17,{"$nulls":12},0]
[293,"Refacciones y accesorios menores de mobiliario  y equipo de administración, educacional y recreativo",11,{"$nulls":12},0]
[null,null,14,{"$nulls":12},0]
[null,null,15,{"$nulls":12},0]
[null,null,16,{"$nulls":12},0]
[null,null,17,{"$nulls":12},0]
[294,"Refacciones y accesorios menores de equipo de cómputo y tecnologías de la información",11,{"$nulls":12},0]
[null,null,14,{"$nulls":12},0]
[null,null,15,{"$nulls":12},0]
[null,null,16,{"$nulls":12},0]
[null,null,17,{"$nulls":12},0]
[295,"Refacciones y accesorios menores de equipo e instrumental médico y de laboratorio",11,{"$nulls":12},0]
[null,null,14,{"$nulls":12},0]
[null,null,15,{"$nulls":12},0]
[null,null,16,{"$nulls":12},0]
[null,null,17,{"$nulls":12},0]
[296,"Refacciones y accesorios menores de equipo de transporte",11,{"v":1163,"d":"1,163"},{"v":1163,"d":"1,163"},{"v":1163,"d":"1,163"},{"v":1163,"d":"1,163"},{"v":1163,"d":"1,163"},{"v":1163,"d":"1,163"},{"v":1163,"d":"1,163"},{"v":1163,"d":"1,163"},{"v":1163,"d":"1,163"},{"v":1163,"d":"1,163"},{"v":1163,"d":"1,163"},{"v":1163,"d":"1,163"},{"v":13956,"d":"13,956"}]
[null,null,14,{"$nulls":12},0]
[null,null,15,{"$nulls":12},0]
[null,null,16,{"$nulls":12},0]
[null,null,17,{"$nulls":12},0]
[null,null,25,{"$nulls":12},0]
[297,"Refacciones y accesorios menores de equipo de defensa y seguridad",11,{"$nulls":12},0]
[null,null,14,{"$nulls":12},0]
[null,null,15,{"$nulls":12},0]
[null,null,16,{"$nulls":12},0]
[null,null,17,{"$nulls":12},0]
[null,null,25,{"$nulls":12},0]
[298,"Refacciones y accesorios menores de maquinaria y otros equipos",11,{"$nulls":12},0]
[null,null,14,{"$nulls":12},0]
[null,null,15,{"$nulls":12},0]
[null,null,16,{"$nulls":12},0]
[null,null,17,{"$nulls":12},0]
[299,"Refacciones y accesorios menores otros bienes muebles",11,{"$nulls":12},0]
[null,null,14,{"$nulls":12},0]
[null,null,15,{"$nulls":12},0]
[null,null,16,{"$nulls":12},0]
[null,null,17,{"$nulls":12},0]
[3000,"SERVICIOS GENERALES",null,{"$f":"D444+D491+D540+D587+D639+D687+D723+D769+D795","v":{"v":21281,"d":"21,281"}},{"v":21281,"d":"21,281"},{"v":21281,"d":"21,281"},{"v":21281,"d":"21,281"},{"v":21281,"d":"21,281"},{"v":21281,"d":"21,281"},{"v":21281,"d":"21,281"},{"v":21281,"d":"21,281"},{"v":21281,"d":"21,281"},{"v":21281,"d":"21,281"},{"v":21281,"d":"21,281"},{"v":21281,"d":"21,281"},{"v":255372,"d":"255,372"}]
[3100,"SERVICIOS BÁSICOS",null,{"$f":"SUM(D445:D490)","v":{"v":7818,"d":"7,818"}},{"v":7818,"d":"7,818"},{"v":7818,"d":"7,818"},{"v":7818,"d":"7,818"},{"v":7818,"d":"7,818"},{"v":7818,"d":"7,818"},{"v":7818,"d":"7,818"},{"v":7818,"d":"7,818"},{"v":7818,"d":"7,818"},{"v":7818,"d":"7,818"},{"v":7818,"d":"7,818"},{"v":7818,"d":"7,818"},{"v":93816,"d":"93,816"}]
[311,"Energía eléctrica",11,{"v":2833,"d":"2,833"},{"v":2833,"d":"2,833"},{"v":2833,"d":"2,833"},{"v":2833,"d":"2,833"},{"v":2833,"d":"2,833"},{"v":2833,"d":"2,833"},{"v":2833,"d":"2,833"},{"v":2833,"d":"2,833"},{"v":2833,"d":"2,833"},{"v":2833,"d":"2,833"},{"v":2833,"d":"2,833"},{"v":2833,"d":"2,833"},{"$f":"SUM(D445:O445)","v":{"v":33996,"d":"33,996"}}]
[null,null,14,{"$nulls":12},0]
[null,null,15,{"$nulls":12},0]
[null,null,16,{"$nulls":12},0]
[null,null,17,{"$nulls":12},0]
[null,null,25,{"$nulls":12},0]
[312,"Gas ",11,567,567,567,567,567,567,567,567,567,567,567,567,{"v":6804,"d":"6,804"}]
[null,null,14,{"$nulls":12},0]
[null,null,15,{"$nulls":12},0]
[null,null,16,{"$nulls":12},0]
[null,null,17,{"$nulls":12},0]
[313,"Agua",11,{"v":1133,"d":"1,133"},{"v":1133,"d":"1,133"},{"v":1133,"d":"1,133"},{"v":1133,"d":"1,133"},{"v":1133,"d":"1,133"},{"v":1133,"d":"1,133"},{"v":1133,"d":"1,133"},{"v":1133,"d":"1,133"},{"v":1133,"d":"1,133"},{"v":1133,"d":"1,133"},{"v":1133,"d":"1,133"},{"v":1133,"d":"1,133"},{"v":13596,"d":"13,596"}]
[null,null,14,{"$nulls":12},0]
[null,null,15,{"$nulls":12},0]
[null,null,16,{"$nulls":12},0]
[null,null,17,{"$nulls":12},0]
[314,"Telefonía tradicional",11,{"v":3285,"d":"3,285"},{"v":3285,"d":"3,285"},{"v":3285,"d":"3,285"},{"v":3285,"d":"3,285"},{"v":3285,"d":"3,285"},{"v":3285,"d":"3,285"},{"v":3285,"d":"3,285"},{"v":3285,"d":"3,285"},{"v":3285,"d":"3,285"},{"v":3285,"d":"3,285"},{"v":3285,"d":"3,285"},{"v":3285,"d":"3,285"},{"v":39420,"d":"39,420"}]
[null,null,14,{"$nulls":12},0]
[null,null,15,{"$nulls":12},0]
[null,null,16,{"$nulls":12},0]
[null,null,17,{"$nulls":12},0]
[315,"Telefonía celular",11,{"$nulls":12},0]
[null,null,14,{"$nulls":12},0]
[null,null,15,{"$nulls":12},0]
[null,null,16,{"$nulls":12},0]
[null,null,17,{"$nulls":12},0]
[316,"Servicios de telecomunicaciones y satélites",11,{"$nulls":12},0]
[null,null,14,{"$nulls":12},0]
[null,null,15,{"$nulls":12},0]
[null,null,16,{"$nulls":12},0]
[null,null,17,{"$nulls":12},0]
[317,"Servicios de acceso de Internet, redes y procesamiento de información",11,{"$nulls":12},0]
[null,null,14,{"$nulls":12},0]
[null,null,15,{"$nulls":12},0]
[null,null,16,{"$nulls":12},0]
[null,null,17,{"$nulls":12},0]
[318,"Servicios postales y telegráficos",11,{"$nulls":12},0]
[null,null,14,{"$nulls":12},0]
[null,null,15,{"$nulls":12},0]
[null,null,16,{"$nulls":12},0]
[null,null,17,{"$nulls":12},0]
[319,"Servicios integrales y otros servicios",11,{"$nulls":12},0]
[null,null,14,{"$nulls":12},0]
[null,null,15,{"$nulls":12},0]
[null,null,16,{"$nulls":12},0]
[null,null,17,{"$nulls":12},0]
[3200,"SERVICIOS DE ARRENDAMIENTO",null,{"$f":"SUM(D492:D539)","v":0},0,0,0,0,0,0,0,0,0,0,0,0]
[321,"Arrendamiento de terrenos",11,{"$nulls":12},0]
[null,null,14,{"$nulls":12},0]
[null,null,15,{"$nulls":12},0]
[null,null,16,{"$nulls":12},0]
[null,null,17,{"$nulls":12},0]
[322,"Arrendamiento de edificios",11,{"$nulls":12},0]
[null,null,14,{"$nulls":12},0]
[null,null,15,{"$nulls":12},0]
[null,null,16,{"$nulls":12},0]
[null,null,17,{"$nulls":12},0]
[null,null,25,{"$nulls":12},0]
[323,"Arrendamiento de mobiliario y equipo de administración, educacional y recreativo",11,{"$nulls":12},0]
[null,null,14,{"$nulls":12},0]
[null,null,15,{"$nulls":12},0]
[null,null,16,{"$nulls":12},0]
[null,null,17,{"$nulls":12},0]
[324,"Arrendamiento de equipo e instrumental médico y de laboratorio",11,{"$nulls":12},0]
[null,null,14,{"$nulls":12},0]
[null,null,15,{"$nulls":12},0]
[null,null,16,{"$nulls":12},0]
[null,null,17,{"$nulls":12},0]
[325,"Arrendamiento de equipo de transporte",11,{"$nulls":12},0]
[null,null,14,{"$nulls":12},0]
[null,null,15,{"$nulls":12},0]
[null,null,16,{"$nulls":12},0]
[null,null,17,{"$nulls":12},0]
[326,"Arrendamiento de maquinaria, otros equipos y herramientas",11,{"$nulls":12},0]
[null,null,14,{"$nulls":12},0]
[null,null,15,{"$nulls":12},0]
[null,null,16,{"$nulls":12},0]
[null,null,17,{"$nulls":12},0]
[null,null,25,{"$nulls":12},0]
[327,"Arrendamiento de activos intangibles",11,{"$nulls":12},0]
[null,null,14,{"$nulls":12},0]
[null,null,15,{"$nulls":12},0]
[null,null,16,{"$nulls":12},0]
[null,null,17,{"$nulls":12},0]
[328,"Arrendamiento financiero",11,{"$nulls":12},0]
[null,null,14,{"$nulls":12},0]
[null,null,15,{"$nulls":12},0]
[null,null,16,{"$nulls":12},0]
[null,null,17,{"$nulls":12},0]
[null,null,25,{"$nulls":12},0]
[329,"Otros arrendamientos",11,{"$nulls":12},0]
[null,null,14,{"$nulls":12},{"$f":"SUM(D536:O536)","v":0}]
[null,null,15,{"$nulls":12},0]
[null,null,16,{"$nulls":12},0]
[null,null,17,{"$nulls":12},0]
[3300,"SERVICIOS PROFESIONALES, CIENTÍFICOS, TÉCNICOS Y OTROS SERVICIOS",null,{"$f":"SUM(D541:D586)","v":{"v":10874,"d":"10,874"}},{"v":10874,"d":"10,874"},{"v":10874,"d":"10,874"},{"v":10874,"d":"10,874"},{"v":10874,"d":"10,874"},{"v":10874,"d":"10,874"},{"v":10874,"d":"10,874"},{"v":10874,"d":"10,874"},{"v":10874,"d":"10,874"},{"v":10874,"d":"10,874"},{"v":10874,"d":"10,874"},{"v":10874,"d":"10,874"},{"v":130488,"d":"130,488"}]
[331,"Servicios legales, de contabilidad, auditoría y relacionados",11,{"v":10874,"d":"10,874"},{"v":10874,"d":"10,874"},{"v":10874,"d":"10,874"},{"v":10874,"d":"10,874"},{"v":10874,"d":"10,874"},{"v":10874,"d":"10,874"},{"v":10874,"d":"10,874"},{"v":10874,"d":"10,874"},{"v":10874,"d":"10,874"},{"v":10874,"d":"10,874"},{"v":10874,"d":"10,874"},{"v":10874,"d":"10,874"},{"$f":"SUM(D541:O541)","v":{"v":130488,"d":"130,488"}}]
[null,null,14,{"$nulls":12},0]
[null,null,15,{"$nulls":12},0]
[null,null,16,{"$nulls":12},0]
[null,null,17,{"$nulls":12},0]
[332,"Servicios de diseño, arquitectura, ingeniería y actividades relacionadas",11,{"$nulls":12},0]
[null,null,14,{"$nulls":12},0]
[null,null,15,{"$nulls":12},0]
[null,null,16,{"$nulls":12},0]
[null,null,17,{"$nulls":12},0]
[null,null,25,{"$nulls":12},0]
[333,"Servicios de consultoría administrativa, procesos, técnica y en tecnologías de la información",11,{"$nulls":12},0]
[null,null,14,{"$nulls":12},0]
[null,null,15,{"$nulls":12},0]
[null,null,16,{"$nulls":12},0]
[null,null,17,{"$nulls":12},0]
[334,"Servicios de capacitación",11,{"$nulls":12},0]
[null,null,14,{"$nulls":12},0]
[null,null,15,{"$nulls":12},0]
[null,null,16,{"$nulls":12},0]
[null,null,17,{"$nulls":12},0]
[335,"Servicios de investigación científica y desarrollo",11,{"$nulls":12},0]
[null,null,14,{"$nulls":12},0]
[null,null,15,{"$nulls":12},0]
[null,null,16,{"$nulls":12},0]
[null,null,17,{"$nulls":12},0]
[336,"Servicios de apoyo administrativo, traducción, fotocopiado e impresión",11,{"$nulls":12},0]
[null,null,14,{"$nulls":12},0]
[null,null,15,{"$nulls":12},0]
[null,null,16,{"$nulls":12},0]
[null,null,17,{"$nulls":12},0]
[337,"Servicios de protección y seguridad",11,{"$nulls":12},0]
[null,null,14,{"$nulls":12},0]
[null,null,15,{"$nulls":12},0]
[null,null,16,{"$nulls":12},0]
[null,null,17,{"$nulls":12},0]
[338,"Servicios de vigilancia",11,{"$nulls":12},0]
[null,null,14,{"$nulls":12},0]
[null,null,15,{"$nulls":12},0]
[null,null,16,{"$nulls":12},0]
[null,null,17,{"$nulls":12},0]
[339,"Servicios profesionales, científicos y técnicos integrales",11,{"$nulls":12},0]
[null,null,14,{"$nulls":12},0]
[null,null,15,{"$nulls":12},0]
[null,null,16,{"$nulls":12},0]
[null,null,17,{"$nulls":12},0]
[3400,"SERVICIOS FINANCIEROS, BANCARIOS Y COMERCIALES",null,{"$f":"SUM(D588:D638)","v":0},0,0,0,0,0,0,0,0,0,0,0,0]
[341,"Servicios financieros y bancarios",11,{"$nulls":12},{"$f":"SUM(D588:O588)","v":0}]
[null,null,14,{"$nulls":12},0]
[null,null,15,{"$nulls":12},0]
[null,null,16,{"$nulls":12},0]
[null,null,17,{"$nulls":12},0]
[null,null,25,{"$nulls":12},0]
[null,null,26,{"$nulls":12},0]
[null,null,27,{"$nulls":12},0]
[342,"Servicios de cobranza, investigación crediticia y similar",11,{"$nulls":12},0]
[null,null,14,{"$nulls":12},0]
[null,null,15,{"$nulls":12},0]
[null,null,16,{"$nulls":12},0]
[null,null,17,{"$nulls":12},0]
[343,"Servicios de recaudación, traslado y custodia de valores",11,{"$nulls":12},0]
[null,null,14,{"$nulls":12},0]
[null,null,15,{"$nulls":12},0]
[null,null,16,{"$nulls":12},0]
[null,null,17,{"$nulls":12},0]
[null,null,25,{"$nulls":12},0]
[null,null,26,{"$nulls":12},0]
[null,null,27,{"$nulls":12},0]
[344,"Seguros de responsabilidad patrimonial y fianzas",11,{"$nulls":12},0]
[null,null,14,{"$nulls":12},0]
[null,null,15,{"$nulls":12},0]
[null,null,16,{"$nulls":12},0]
[null,null,17,{"$nulls":12},0]
[345,"Seguro de bienes patrimoniales",11,{"$nulls":12},0]
[null,null,14,{"$nulls":12},0]
[null,null,15,{"$nulls":12},0]
[null,null,16,{"$nulls":12},0]
[null,null,17,{"$nulls":12},0]
[346,"Almacenaje, envase y embalaje",11,{"$nulls":12},0]
[null,null,14,{"$nulls":12},0]
[null,null,15,{"$nulls":12},0]
[null,null,16,{"$nulls":12},0]
[null,null,17,{"$nulls":12},0]
[347,"Fletes y maniobras",11,{"$nulls":12},0]
[null,null,14,{"$nulls":12},0]
[null,null,15,{"$nulls":12},0]
[null,null,16,{"$nulls":12},0]
[null,null,17,{"$nulls":12},0]
[348,"Comisiones por ventas",11,{"$nulls":12},0]
[null,null,14,{"$nulls":12},0]
[null,null,15,{"$nulls":12},0]
[null,null,16,{"$nulls":12},0]
[null,null,17,{"$nulls":12},0]
[349,"Servicios financieros, bancarios y comerciales integrales",11,{"$nulls":12},0]
[null,null,14,{"$nulls":12},0]
[null,null,15,{"$nulls":12},0]
[null,null,16,{"$nulls":12},0]
[null,null,17,{"$nulls":12},0]
[3500,"SERVICIOS DE INSTALACIÓN, REPARACIÓN, MANTENIMIENTO Y CONSERVACIÓN",null,{"$f":"SUM(D640:D686)","v":0},0,0,0,0,0,0,0,0,0,0,0,0]
[351,"Conservación y mantenimiento menor de inmuebles",11,{"$nulls":12},{"$f":"SUM(D640:O640)","v":0}]
[null,null,14,{"$nulls":12},0]
[null,null,15,{"$nulls":12},0]
[null,null,16,{"$nulls":12},0]
[null,null,17,{"$nulls":12},0]
[352,"Instalación, reparación y mantenimiento de mobiliario y equipo de administración, educacional y recreativo",11,{"$nulls":12},0]
[null,null,14,{"$nulls":12},0]
[null,null,15,{"$nulls":12},0]
[null,null,16,{"$nulls":12},0]
[null,null,17,{"$nulls":12},0]
[353,"Instalación, reparación y mantenimiento de equipo de cómputo y tecnología de la información",11,{"$nulls":12},0]
[null,null,14,{"$nulls":12},0]
[null,null,15,{"$nulls":12},0]
[null,null,16,{"$nulls":12},0]
[null,null,17,{"$nulls":12},0]
[354,"Instalación, reparación y mantenimiento de equipo e instrumental médico y de laboratorio",11,{"$nulls":12},0]
[null,null,14,{"$nulls":12},0]
[null,null,15,{"$nulls":12},0]
[null,null,16,{"$nulls":12},0]
[null,null,17,{"$nulls":12},0]
[355,"Reparación y mantenimiento de equipo de transporte",11,{"$nulls":12},0]
[null,null,14,{"$nulls":12},0]
[null,null,15,{"$nulls":12},0]
[null,null,16,{"$nulls":12},0]
[null,null,17,{"$nulls":12},0]
[null,null,25,{"$nulls":12},0]
[356,"Reparación y mantenimiento de equipo de defensa y seguridad",11,{"$nulls":12},0]
[null,null,14,{"$nulls":12},0]
[null,null,15,{"$nulls":12},0]
[null,null,16,{"$nulls":12},0]
[null,null,17,{"$nulls":12},0]
[null,null,25,{"$nulls":12},0]
[357,"Instalación, reparación y mantenimiento de maquinaria, otros equipos y herramienta",11,{"$nulls":12},0]
[null,null,14,{"$nulls":12},0]
[null,null,15,{"$nulls":12},0]
[null,null,16,{"$nulls":12},0]
[null,null,17,{"$nulls":12},0]
[358,"Servicios de limpieza y manejo de desechos",11,{"$nulls":12},0]
[null,null,14,{"$nulls":12},0]
[null,null,15,{"$nulls":12},0]
[null,null,16,{"$nulls":12},0]
[null,null,17,{"$nulls":12},0]
[359,"Servicios de jardinería y fumigación",11,{"$nulls":12},0]
[null,null,14,{"$nulls":12},0]
[null,null,15,{"$nulls":12},0]
[null,null,16,{"$nulls":12},0]
[null,null,17,{"$nulls":12},0]
[3600,"SERVICIOS DE COMUNICACIÓN SOCIAL Y PUBLICIDAD",null,{"$f":"SUM(D688:D722)","v":0},0,0,0,0,0,0,0,0,0,0,0,0]
[361,"Difusión por radio, televisión y otros medios de mensajes sobre programas y actividades gubernamentales",11,{"$nulls":12},{"$f":"SUM(D688:O688)","v":0}]
[null,null,14,{"$nulls":12},0]
[null,null,15,{"$nulls":12},0]
[null,null,16,{"$nulls":12},0]
[null,null,17,{"$nulls":12},0]
[362,"Difusión por radio,  televisión y otros medios de mensajes comerciales para promover la venta de bienes o servicios",11,{"$nulls":12},0]
[null,null,14,{"$nulls":12},0]
[null,null,15,{"$nulls":12},0]
[null,null,16,{"$nulls":12},0]
[null,null,17,{"$nulls":12},0]
[363,"Servicios de creatividad, preproducción y producción de publicidad, excepto Internet",11,{"$nulls":12},0]
[null,null,14,{"$nulls":12},0]
[null,null,15,{"$nulls":12},0]
[null,null,16,{"$nulls":12},0]
[null,null,17,{"$nulls":12},0]
[364,"Servicios de revelado de  fotografías",11,{"$nulls":12},0]
[null,null,14,{"$nulls":12},0]
[null,null,15,{"$nulls":12},0]
[null,null,16,{"$nulls":12},0]
[null,null,17,{"$nulls":12},0]
[365,"Servicios de la industria fílmica, del sonido y del video",11,{"$nulls":12},0]
[null,null,14,{"$nulls":12},0]
[null,null,15,{"$nulls":12},0]
[null,null,16,{"$nulls":12},0]
[null,null,17,{"$nulls":12},0]
[366,"Servicio de creación y difusión de contenido exclusivamente a través de Internet",11,{"$nulls":12},0]
[null,null,14,{"$nulls":12},0]
[null,null,15,{"$nulls":12},0]
[null,null,16,{"$nulls":12},0]
[null,null,17,{"$nulls":12},0]
[369,"Otros servicios de información",11,{"$nulls":12},0]
[null,null,14,{"$nulls":12},0]
[null,null,15,{"$nulls":12},0]
[null,null,16,{"$nulls":12},0]
[null,null,17,{"$nulls":12},0]
[3700,"SERVICIOS DE TRASLADO Y VIÁTICOS",null,{"$f":"SUM(D724:D768)","v":{"v":2589,"d":"2,589"}},{"v":2589,"d":"2,589"},{"v":2589,"d":"2,589"},{"v":2589,"d":"2,589"},{"v":2589,"d":"2,589"},{"v":2589,"d":"2,589"},{"v":2589,"d":"2,589"},{"v":2589,"d":"2,589"},{"v":2589,"d":"2,589"},{"v":2589,"d":"2,589"},{"v":2589,"d":"2,589"},{"v":2589,"d":"2,589"},{"v":31068,"d":"31,068"}]
[371,"Pasajes aéreos",11,{"$nulls":12},{"$f":"SUM(D724:O724)","v":0}]
[null,null,14,{"$nulls":12},0]
[null,null,15,{"$nulls":12},0]
[null,null,16,{"$nulls":12},0]
[null,null,17,{"$nulls":12},0]
[372,"Pasajes terrestres",11,{"v":2589,"d":"2,589"},{"v":2589,"d":"2,589"},{"v":2589,"d":"2,589"},{"v":2589,"d":"2,589"},{"v":2589,"d":"2,589"},{"v":2589,"d":"2,589"},{"v":2589,"d":"2,589"},{"v":2589,"d":"2,589"},{"v":2589,"d":"2,589"},{"v":2589,"d":"2,589"},{"v":2589,"d":"2,589"},{"v":2589,"d":"2,589"},{"v":31068,"d":"31,068"}]
[null,null,14,{"$nulls":12},0]
[null,null,15,{"$nulls":12},0]
[null,null,16,{"$nulls":12},0]
[null,null,17,{"$nulls":12},0]
[373,"Pasajes marítimos, lacustres y fluviales",11,{"$nulls":12},0]
[null,null,14,{"$nulls":12},0]
[null,null,15,{"$nulls":12},0]
[null,null,16,{"$nulls":12},0]
[null,null,17,{"$nulls":12},0]
[374,"Autotransporte",11,{"$nulls":12},0]
[null,null,14,{"$nulls":12},0]
[null,null,15,{"$nulls":12},0]
[null,null,16,{"$nulls":12},0]
[null,null,17,{"$nulls":12},0]
[375,"Viáticos en el país",11,{"$nulls":12},0]
[null,null,14,{"$nulls":12},0]
[null,null,15,{"$nulls":12},0]
[null,null,16,{"$nulls":12},0]
[null,null,17,{"$nulls":12},0]
[376,"Viáticos en el extranjero ",11,{"$nulls":12},0]
[null,null,14,{"$nulls":12},0]
[null,null,15,{"$nulls":12},0]
[null,null,16,{"$nulls":12},0]
[null,null,17,{"$nulls":12},0]
[377,"Gastos de instalación y traslado de menaje",11,{"$nulls":12},0]
[null,null,14,{"$nulls":12},0]
[null,null,15,{"$nulls":12},0]
[null,null,16,{"$nulls":12},0]
[null,null,17,{"$nulls":12},0]
[378,"Servicios integrales de traslado y viáticos",11,{"$nulls":12},0]
[null,null,14,{"$nulls":12},0]
[null,null,15,{"$nulls":12},0]
[null,null,16,{"$nulls":12},0]
[null,null,17,{"$nulls":12},0]
[379,"Otros servicios de traslado y hospedaje",11,{"$nulls":12},0]
[null,null,14,{"$nulls":12},0]
[null,null,15,{"$nulls":12},0]
[null,null,16,{"$nulls":12},0]
[null,null,17,{"$nulls":12},0]
[3800,"SERVICIOS OFICIALES",null,{"$f":"SUM(D770:D794)","v":0},0,0,0,0,0,0,0,0,0,0,0,0]
[381,"Gastos de ceremonial",11,{"$nulls":12},{"$f":"SUM(D770:O770)","v":0}]
[null,null,14,{"$nulls":12},{"$f":"SUM(D771:O771)","v":0}]
[null,null,15,{"$nulls":12},0]
[null,null,16,{"$nulls":12},0]
[null,null,17,{"$nulls":12},0]
[382,"Gastos de orden  social y cultural",11,{"$nulls":12},0]
[null,null,14,{"$nulls":12},0]
[null,null,15,{"$nulls":12},0]
[null,null,16,{"$nulls":12},0]
[null,null,17,{"$nulls":12},0]
[383,"Congresos y convenciones",11,{"$nulls":12},0]
[null,null,14,{"$nulls":12},0]
[null,null,15,{"$nulls":12},0]
[null,null,16,{"$nulls":12},0]
[null,null,17,{"$nulls":12},0]
[384,"Exposiciones",11,{"$nulls":12},0]
[null,null,14,{"$nulls":12},0]
[null,null,15,{"$nulls":12},0]
[null,null,16,{"$nulls":12},0]
[null,null,17,{"$nulls":12},0]
[385,"Gastos de representación",11,{"$nulls":12},0]
[null,null,14,{"$nulls":12},0]
[null,null,15,{"$nulls":12},0]
[null,null,16,{"$nulls":12},0]
[null,null,17,{"$nulls":12},0]
[3900,"OTROS SERVICIOS GENERALES",null,{"$f":"SUM(D796:D836)","v":0},0,0,0,0,0,0,0,0,0,0,0,0]
[391,"Servicios funerarios y de cementerios",11,{"$nulls":12},{"$f":"SUM(D796:O796)","v":0}]
[null,null,14,{"$nulls":12},0]
[null,null,15,{"$nulls":12},0]
[null,null,16,{"$nulls":12},0]
[null,null,17,{"$nulls":12},0]
[392,"Impuestos y derechos",11,{"$nulls":12},0]
[null,null,14,{"$nulls":12},0]
[null,null,15,{"$nulls":12},0]
[null,null,16,{"$nulls":12},0]
[null,null,17,{"$nulls":12},0]
[393,"Impuestos y derechos de importación",11,{"$nulls":12},0]
[null,null,14,{"$nulls":12},0]
[null,null,15,{"$nulls":12},0]
[null,null,16,{"$nulls":12},0]
[null,null,17,{"$nulls":12},0]
[394,"Sentencias y resoluciones por autoridad competente",11,{"$nulls":12},0]
[null,null,14,{"$nulls":12},0]
[null,null,15,{"$nulls":12},0]
[null,null,16,{"$nulls":12},0]
[null,null,17,{"$nulls":12},0]
[395,"Penas, multas, accesorios y actualizaciones",11,{"$nulls":12},0]
[null,null,14,{"$nulls":12},0]
[null,null,15,{"$nulls":12},0]
[null,null,16,{"$nulls":12},0]
[null,null,17,{"$nulls":12},0]
[396,"Otros gastos por responsabilidades",11,{"$nulls":12},0]
[null,null,14,{"$nulls":12},0]
[null,null,15,{"$nulls":12},0]
[null,null,16,{"$nulls":12},0]
[null,null,17,{"$nulls":12},0]
[397,"Utilidades",{"$nulls":13},{"$f":"SUM(D826:O826)","v":0}]
[398,"Impuesto sobre nómina y otros que se deriven de una relación laboral",11,{"$nulls":12},0]
[null,null,14,{"$nulls":12},0]
[null,null,15,{"$nulls":12},0]
[null,null,16,{"$nulls":12},0]
[null,null,17,{"$nulls":12},0]
[399,"Otros servicios generales",11,{"$nulls":12},0]
[null,null,14,{"$nulls":12},0]
[null,null,15,{"$nulls":12},0]
[null,null,16,{"$nulls":12},0]
[null,null,17,{"$nulls":12},0]
[4000,"TRANSFERENCIAS, ASIGNACIONES, SUBSIDIOS Y OTRAS  AYUDAS",null,{"$f":"D838+D856+D866+D932+D997+D1013+D1033+D1039+D1065","v":{"v":5818,"d":"5,818"}},{"v":5818,"d":"5,818"},{"v":5818,"d":"5,818"},{"v":5818,"d":"5,818"},{"v":5818,"d":"5,818"},{"v":5818,"d":"5,818"},{"v":5818,"d":"5,818"},{"v":5818,"d":"5,818"},{"v":5818,"d":"5,818"},{"v":5818,"d":"5,818"},{"v":5818,"d":"5,818"},{"v":5818,"d":"5,818"},{"v":69816,"d":"69,816"}]
[4100,"TRANSFERENCIAS INTERNAS Y ASIGNACIONES AL SECTOR PÚBLICO",null,{"$f":"SUM(D839:D855)","v":0},0,0,0,0,0,0,0,0,0,0,0,0]
[411,"Asignaciones presupuestarias al Poder Ejecutivo",{"$nulls":13},{"$f":"SUM(D839:O839)","v":0}]
[412,"Asignaciones presupuestarias al Poder Legislativo",{"$nulls":13},0]
[413,"Asignaciones presupuestarias al Poder Judicial",{"$nulls":13},0]
[414,"Asignaciones presupuestarias a Órganos Autónomos",{"$nulls":13},0]
[415,"Transferencias internas otorgadas a entidades paraestatales no empresariales y no financieras",11,{"$nulls":12},{"$f":"SUM(D843:O843)","v":0}]
[null,null,14,{"$nulls":12},0]
[null,null,15,{"$nulls":12},0]
[null,null,16,{"$nulls":12},0]
[null,null,17,{"$nulls":12},0]
[416,"Transferencias internas otorgadas a entidades paraestatales empresariales y no financieras",{"$nulls":13},{"$f":"SUM(D848:O848)","v":0}]
[417,"Transferencias internas otorgadas a fideicomisos públicos empresariales y no financieros",11,{"$nulls":12},0]
[null,null,14,{"$nulls":12},0]
[null,null,15,{"$nulls":12},0]
[null,null,16,{"$nulls":12},0]
[null,null,17,{"$nulls":12},0]
[418,"Transferencias internas otorgadas a instituciones paraestatales públicas financieras",{"$nulls":13},0]
[419,"Transferencias internas otorgadas a fideicomisos públicos financieros",{"$nulls":13},0]
[4200,"TRANSFERENCIAS AL RESTO DEL SECTOR PÚBLICO",null,{"$f":"SUM(D857:D865)","v":0},0,0,0,0,0,0,0,0,0,0,0,0]
[421,"Transferencias otorgadas a entidades paraestatales no empresariales y no financieras",11,{"$nulls":12},{"$f":"SUM(D857:O857)","v":0}]
[null,null,14,{"$nulls":12},{"$f":"SUM(D858:O858)","v":0}]
[null,null,15,{"$nulls":12},0]
[null,null,16,{"$nulls":12},0]
[null,null,17,{"$nulls":12},0]
[422,"Transferencias otorgadas para entidades paraestatales empresariales y no financieras",{"$nulls":13},0]
[423,"Transferencias otorgadas para instituciones paraestatales públicas financieras  ",{"$nulls":13},0]
[424,"Transferencias otorgadas a entidades federativas y municipios",{"$nulls":13},0]
[425,"Transferencias a fideicomisos de entidades federativas y municipios",{"$nulls":13},0]
[4300,"SUBSIDIOS Y SUBVENCIONES",null,{"$f":"SUM(D867:D931)","v":0},{"$f":"SUM(E867:E931)","v":0},0,0,0,0,0,0,0,0,0,0,0]
[431,"Subsidios a la producción",11,{"$nulls":12},{"$f":"SUM(D867:O867)","v":0}]
[null,null,14,{"$nulls":12},0]
[null,null,15,{"$nulls":12},0]
[null,null,16,{"$nulls":12},0]
[null,null,17,{"$nulls":12},0]
[null,null,25,{"$nulls":12},0]
[null,null,26,{"$nulls":12},0]
[null,null,27,{"$nulls":12},0]
[432,"Subsidios a la distribución",11,{"$nulls":12},0]
[null,null,14,{"$nulls":12},0]
[null,null,15,{"$nulls":12},0]
[null,null,16,{"$nulls":12},0]
[null,null,17,{"$nulls":12},0]
[null,null,25,{"$nulls":12},0]
[null,null,26,{"$nulls":12},0]
[null,null,27,{"$nulls":12},0]
[433,"Subsidios a la inversión",11,{"$nulls":12},0]
[null,null,14,{"$nulls":12},0]
[null,null,15,{"$nulls":12},0]
[null,null,16,{"$nulls":12},0]
[null,null,17,{"$nulls":12},0]
[null,null,25,{"$nulls":12},0]
[null,null,26,{"$nulls":12},0]
[null,null,27,{"$nulls":12},0]
[434,"Subsidios a la prestación de servicios públicos",11,{"$nulls":12},0]
[null,null,14,{"$nulls":12},0]
[null,null,15,{"$nulls":12},0]
[null,null,16,{"$nulls":12},0]
[null,null,17,{"$nulls":12},0]
[null,null,25,{"$nulls":12},0]
[null,null,26,{"$nulls":12},0]
[null,null,27,{"$nulls":12},0]
[435,"Subsidios para cubrir diferenciales de tasas de interés",11,{"$nulls":12},0]
[null,null,14,{"$nulls":12},0]
[null,null,15,{"$nulls":12},0]
[null,null,16,{"$nulls":12},0]
[null,null,17,{"$nulls":12},0]
[null,null,25,{"$nulls":12},0]
[null,null,26,{"$nulls":12},0]
[null,null,27,{"$nulls":12},0]
[436,"Subsidios a la vivienda ",11,{"$nulls":12},0]
[null,null,14,{"$nulls":12},0]
[null,null,15,{"$nulls":12},0]
[null,null,16,{"$nulls":12},0]
[null,null,17,{"$nulls":12},0]
[null,null,25,{"$nulls":12},0]
[null,null,26,{"$nulls":12},0]
[null,null,27,{"$nulls":12},0]
[437,"Subvenciones al consumo",11,{"$nulls":12},0]
[null,null,14,{"$nulls":12},0]
[null,null,15,{"$nulls":12},0]
[null,null,16,{"$nulls":12},0]
[null,null,17,{"$nulls":12},0]
[null,null,25,{"$nulls":12},0]
[null,null,26,{"$nulls":12},0]
[null,null,27,{"$nulls":12},0]
[438,"Subsidios a entidades federativas y municipios",{"$nulls":13},{"$f":"SUM(D923:O923)","v":0}]
[439,"Otros subsidios",11,{"$nulls":12},0]
[null,null,14,{"$nulls":12},0]
[null,null,15,{"$nulls":12},0]
[null,null,16,{"$nulls":12},0]
[null,null,17,{"$nulls":12},0]
[null,null,25,{"$nulls":12},0]
[null,null,26,{"$nulls":12},0]
[null,null,27,{"$nulls":12},{"$f":"SUM(D931:O931)","v":0}]
[4400,"AYUDAS SOCIALES",null,{"$f":"SUM(D933:D996)","v":{"v":5818,"d":"5,818"}},{"v":5818,"d":"5,818"},{"v":5818,"d":"5,818"},{"v":5818,"d":"5,818"},{"v":5818,"d":"5,818"},{"v":5818,"d":"5,818"},{"v":5818,"d":"5,818"},{"v":5818,"d":"5,818"},{"v":5818,"d":"5,818"},{"v":5818,"d":"5,818"},{"v":5818,"d":"5,818"},{"v":5818,"d":"5,818"},{"v":69816,"d":"69,816"}]
[441,"Ayudas sociales a personas ",11,{"v":5818,"d":"5,818"},{"v":5818,"d":"5,818"},{"v":5818,"d":"5,818"},{"v":5818,"d":"5,818"},{"v":5818,"d":"5,818"},{"v":5818,"d":"5,818"},{"v":5818,"d":"5,818"},{"v":5818,"d":"5,818"},{"v":5818,"d":"5,818"},{"v":5818,"d":"5,818"},{"v":5818,"d":"5,818"},{"v":5818,"d":"5,818"},{"$f":"SUM(D933:O933)","v":{"v":69816,"d":"69,816"}}]
[null,null,14,{"$nulls":12},0]
[null,null,15,{"$nulls":12},0]
[null,null,16,{"$nulls":12},0]
[null,null,17,{"$nulls":12},0]
[null,null,25,{"$nulls":12},0]
[null,null,26,{"$nulls":12},0]
[null,null,27,{"$nulls":12},0]
[442,"Becas y otras ayudas para programas de capacitación",11,{"$nulls":12},0]
[null,null,14,{"$nulls":12},0]
[null,null,15,{"$nulls":12},0]
[null,null,16,{"$nulls":12},0]
[null,null,17,{"$nulls":12},0]
[null,null,25,{"$nulls":12},0]
[null,null,26,{"$nulls":12},0]
[null,null,27,{"$nulls":12},0]
[443,"Ayudas sociales a instituciones de enseñanza",11,{"$nulls":12},0]
[null,null,14,{"$nulls":12},0]
[null,null,15,{"$nulls":12},0]
[null,null,16,{"$nulls":12},0]
[null,null,17,{"$nulls":12},0]
[null,null,25,{"$nulls":12},0]
[null,null,26,{"$nulls":12},0]
[null,null,27,{"$nulls":12},0]
[444,"Ayudas sociales a actividades científicas o académicas",11,{"$nulls":12},0]
[null,null,14,{"$nulls":12},0]
[null,null,15,{"$nulls":12},0]
[null,null,16,{"$nulls":12},0]
[null,null,17,{"$nulls":12},0]
[null,null,25,{"$nulls":12},0]
[null,null,26,{"$nulls":12},0]
[null,null,27,{"$nulls":12},0]
[445,"Ayudas sociales a instituciones sin fines de lucro",11,{"$nulls":12},0]
[null,null,14,{"$nulls":12},0]
[null,null,15,{"$nulls":12},0]
[null,null,16,{"$nulls":12},0]
[null,null,17,{"$nulls":12},0]
[null,null,25,{"$nulls":12},0]
[null,null,26,{"$nulls":12},0]
[null,null,27,{"$nulls":12},0]
[446,"Ayudas sociales a cooperativas",11,{"$nulls":12},0]
[null,null,14,{"$nulls":12},0]
[null,null,15,{"$nulls":12},0]
[null,null,16,{"$nulls":12},0]
[null,null,17,{"$nulls":12},0]
[null,null,25,{"$nulls":12},0]
[null,null,26,{"$nulls":12},0]
[null,null,27,{"$nulls":12},0]
[447,"Ayudas sociales a entidades de interés público",11,{"$nulls":12},0]
[null,null,14,{"$nulls":12},0]
[null,null,15,{"$nulls":12},0]
[null,null,16,{"$nulls":12},0]
[null,null,17,{"$nulls":12},0]
[null,null,25,{"$nulls":12},0]
[null,null,26,{"$nulls":12},0]
[null,null,27,{"$nulls":12},0]
[448,"Ayudas por desastres naturales y otros siniestros",11,{"$nulls":12},0]
[null,null,14,{"$nulls":12},0]
[null,null,15,{"$nulls":12},0]
[null,null,16,{"$nulls":12},0]
[null,null,17,{"$nulls":12},0]
[null,null,25,{"$nulls":12},0]
[null,null,26,{"$nulls":12},0]
[null,null,27,{"$nulls":12},0]
[4500,"PENSIONES Y JUBILACIONES",null,{"$f":"SUM(D998:D1012)","v":0},0,0,0,0,0,0,0,0,0,0,0,0]
[451,"Pensiones",11,{"$nulls":12},{"$f":"SUM(D998:O998)","v":0}]
[null,null,14,{"$nulls":12},{"$f":"SUM(D999:O999)","v":0}]
[null,null,15,{"$nulls":12},0]
[null,null,16,{"$nulls":12},0]
[null,null,17,{"$nulls":12},0]
[452,"Jubilaciones",11,{"$nulls":12},0]
[null,null,14,{"$nulls":12},0]
[null,null,15,{"$nulls":12},0]
[null,null,16,{"$nulls":12},0]
[null,null,17,{"$nulls":12},0]
[459,"Otras pensiones y jubilaciones",11,{"$nulls":12},0]
[null,null,14,{"$nulls":12},0]
[null,null,15,{"$nulls":12},0]
[null,null,16,{"$nulls":12},0]
[null,null,17,{"$nulls":12},0]
[4600,"TRANSFERENCIAS A FIDEICOMISOS, MANDATOS Y OTROS ANÁLOGOS",null,{"$f":"SUM(D1014:D1032)","v":0},0,0,0,0,0,0,0,0,0,0,0,0]
[461,"Transferencias a fideicomisos del Poder Ejecutivo",11,{"$nulls":12},{"$f":"SUM(D1014:O1014)","v":0}]
[null,null,14,{"$nulls":12},0]
[null,null,15,{"$nulls":12},0]
[null,null,16,{"$nulls":12},0]
[null,null,17,{"$nulls":12},0]
[462,"Transferencias a fideicomisos del Poder Legislativo",{"$nulls":13},0]
[463,"Transferencias a fideicomisos del Poder Judicial",{"$nulls":13},0]
[464,"Trasferencias a fideicomisos públicos de entidades paraestatales no empresariales y no financieras",11,{"$nulls":12},0]
[null,null,14,{"$nulls":12},0]
[null,null,15,{"$nulls":12},0]
[null,null,16,{"$nulls":12},0]
[null,null,17,{"$nulls":12},0]
[465,"Transferencias a fideicomisos públicos de entidades paraestatales empresariales y no financieras",{"$nulls":13},0]
[466,"Transferencias a fideicomisos de instituciones públicas financieras",{"$nulls":13},0]
[469,"Otras transferencias a fideicomisos   ",11,{"$nulls":12},0]
[null,null,14,{"$nulls":12},0]
[null,null,15,{"$nulls":12},0]
[null,null,16,{"$nulls":12},0]
[null,null,17,{"$nulls":12},0]
[4700,"TRANSFERENCIAS A LA SEGURIDAD SOCIAL",null,{"$f":"SUM(D1034:D1038)","v":0},0,0,0,0,0,0,0,0,0,0,0,0]
[471,"Transferencias por obligación de ley",11,{"$nulls":12},{"$f":"SUM(D1034:O1034)","v":0}]
[null,null,14,{"$nulls":12},{"$f":"SUM(D1035:O1035)","v":0}]
[null,null,15,{"$nulls":12},0]
[null,null,16,{"$nulls":12},0]
[null,null,17,{"$nulls":12},0]
[4800,"DONATIVOS",null,{"$f":"SUM(D1040:D1064)","v":0},0,0,0,0,0,0,0,0,0,0,0,0]
[481,"Donativos a instituciones sin fines de lucro",11,{"$nulls":12},{"$f":"SUM(D1040:O1040)","v":0}]
[null,null,14,{"$nulls":12},{"$f":"SUM(D1041:O1041)","v":0}]
[null,null,15,{"$nulls":12},0]
[null,null,16,{"$nulls":12},0]
[null,null,17,{"$nulls":12},0]
[482,"Donativos a entidades federativas ",11,{"$nulls":12},0]
[null,null,14,{"$nulls":12},0]
[null,null,15,{"$nulls":12},0]
[null,null,16,{"$nulls":12},0]
[null,null,17,{"$nulls":12},0]
[483,"Donativos a fideicomisos privados",11,{"$nulls":12},0]
[null,null,14,{"$nulls":12},0]
[null,null,15,{"$nulls":12},0]
[null,null,16,{"$nulls":12},0]
[null,null,17,{"$nulls":12},0]
[484,"Donativos a fideicomisos estatales",11,{"$nulls":12},0]
[null,null,14,{"$nulls":12},0]
[null,null,15,{"$nulls":12},0]
[null,null,16,{"$nulls":12},0]
[null,null,17,{"$nulls":12},0]
[485,"Donativos internacionales",11,{"$nulls":12},0]
[null,null,14,{"$nulls":12},0]
[null,null,15,{"$nulls":12},0]
[null,null,16,{"$nulls":12},0]
[null,null,17,{"$nulls":12},0]
[4900,"TRANSFERENCIAS AL EXTERIOR",null,{"$f":"SUM(D1066:D1080)","v":0},0,0,0,0,0,0,0,0,0,0,0,0]
[491,"Transferencias para gobiernos extranjeros",11,{"$nulls":12},{"$f":"SUM(D1066:O1066)","v":0}]
[null,null,14,{"$nulls":12},{"$f":"SUM(D1067:O1067)","v":0}]
[null,null,15,{"$nulls":12},0]
[null,null,16,{"$nulls":12},0]
[null,null,17,{"$nulls":12},0]
[492,"Transferencias para organismos internacionales",11,{"$nulls":12},0]
[null,null,14,{"$nulls":12},0]
[null,null,15,{"$nulls":12},0]
[null,null,16,{"$nulls":12},0]
[null,null,17,{"$nulls":12},0]
[493,"Transferencias para el sector privado externo",11,{"$nulls":12},0]
[null,null,14,{"$nulls":12},0]
[null,null,15,{"$nulls":12},0]
[null,null,16,{"$nulls":12},0]
[null,null,17,{"$nulls":12},0]
[5000,"BIENES MUEBLES, INMUEBLES E INTANGIBLES ",null,{"$f":"D1082+D1137+D1173+D1192+D1247+D1257+D1330+D1412+D1449","v":{"v":1618,"d":"1,618"}},{"$f":"E1082+E1137+E1173+E1192+E1247+E1257+E1330+E1412+E1449","v":{"v":1618,"d":"1,618"}},{"v":1618,"d":"1,618"},{"v":1618,"d":"1,618"},{"v":1618,"d":"1,618"},{"v":1618,"d":"1,618"},{"v":1618,"d":"1,618"},{"v":1618,"d":"1,618"},{"v":1618,"d":"1,618"},{"v":1618,"d":"1,618"},{"v":1618,"d":"1,618"},{"v":1618,"d":"1,618"},{"v":19416,"d":"19,416"}]
[5100,"MOBILIARIO Y EQUIPO DE ADMINISTRACIÓN",null,{"$f":"SUM(D1083:D1136)","v":{"v":1618,"d":"1,618"}},{"$f":"SUM(E1083:E1136)","v":{"v":1618,"d":"1,618"}},{"v":1618,"d":"1,618"},{"v":1618,"d":"1,618"},{"v":1618,"d":"1,618"},{"v":1618,"d":"1,618"},{"v":1618,"d":"1,618"},{"v":1618,"d":"1,618"},{"v":1618,"d":"1,618"},{"v":1618,"d":"1,618"},{"v":1618,"d":"1,618"},{"v":1618,"d":"1,618"},{"v":19416,"d":"19,416"}]
[511,"Muebles de oficina y estantería ",11,{"$nulls":12},{"$f":"SUM(D1083:O1083)","v":0}]
[null,null,12,{"$nulls":12},0]
[null,null,14,{"$nulls":12},0]
[null,null,15,{"$nulls":12},0]
[null,null,16,{"$nulls":12},0]
[null,null,17,{"$nulls":12},0]
[null,null,25,{"$nulls":12},0]
[null,null,26,{"$nulls":12},0]
[null,null,27,{"$nulls":12},0]
[512,"Muebles, excepto de oficina y estantería",11,{"$nulls":12},0]
[null,null,12,{"$nulls":12},0]
[null,null,14,{"$nulls":12},0]
[null,null,15,{"$nulls":12},0]
[null,null,16,{"$nulls":12},0]
[null,null,17,{"$nulls":12},0]
[null,null,25,{"$nulls":12},0]
[null,null,26,{"$nulls":12},0]
[null,null,27,{"$nulls":12},0]
[513,"Bienes artísticos, culturales y científicos",11,{"$nulls":12},0]
[null,null,12,{"$nulls":12},0]
[null,null,14,{"$nulls":12},0]
[null,null,15,{"$nulls":12},0]
[null,null,16,{"$nulls":12},0]
[null,null,17,{"$nulls":12},0]
[null,null,25,{"$nulls":12},0]
[null,null,26,{"$nulls":12},0]
[null,null,27,{"$nulls":12},0]
[514,"Objetos de valor",11,{"$nulls":12},0]
[null,null,12,{"$nulls":12},0]
[null,null,14,{"$nulls":12},0]
[null,null,15,{"$nulls":12},0]
[null,null,16,{"$nulls":12},0]
[null,null,17,{"$nulls":12},0]
[null,null,25,{"$nulls":12},0]
[null,null,26,{"$nulls":12},0]
[null,null,27,{"$nulls":12},0]
[515,"Equipo de cómputo de tecnologías de la información",11,{"v":1618,"d":"1,618"},{"v":1618,"d":"1,618"},{"v":1618,"d":"1,618"},{"v":1618,"d":"1,618"},{"v":1618,"d":"1,618"},{"v":1618,"d":"1,618"},{"v":1618,"d":"1,618"},{"v":1618,"d":"1,618"},{"v":1618,"d":"1,618"},{"v":1618,"d":"1,618"},{"v":1618,"d":"1,618"},{"v":1618,"d":"1,618"},{"v":19416,"d":"19,416"}]
[null,null,12,{"$nulls":12},0]
[null,null,14,{"$nulls":12},0]
[null,null,15,{"$nulls":12},0]
[null,null,16,{"$nulls":12},0]
[null,null,17,{"$nulls":12},0]
[null,null,25,{"$nulls":12},0]
[null,null,26,{"$nulls":12},0]
[null,null,27,{"$nulls":12},0]
[519,"Otros mobiliarios y equipos de administración",11,{"$nulls":12},0]
[null,null,12,{"$nulls":12},0]
[null,null,14,{"$nulls":12},0]
[null,null,15,{"$nulls":12},0]
[null,null,16,{"$nulls":12},0]
[null,null,17,{"$nulls":12},0]
[null,null,25,{"$nulls":12},0]
[null,null,26,{"$nulls":12},0]
[null,null,27,{"$nulls":12},0]
[5200,"MOBILIARIO Y EQUIPO EDUCACIONAL Y RECREATIVO",null,{"$f":"SUM(D1138:D1172)","v":0},{"$f":"SUM(E1138:E1172)","v":0},0,0,0,0,0,0,0,0,0,0,0]
[521,"Equipos y aparatos audiovisuales",11,{"$nulls":12},{"$f":"SUM(D1138:O1138)","v":0}]
[null,null,12,{"$nulls":12},{"$f":"SUM(D1139:O1139)","v":0}]
[null,null,14,{"$nulls":12},0]
[null,null,15,{"$nulls":12},0]
[null,null,16,{"$nulls":12},0]
[null,null,17,{"$nulls":12},0]
[null,null,25,{"$nulls":12},0]
[null,null,26,{"$nulls":12},0]
[null,null,27,{"$nulls":12},0]
[522,"Aparatos deportivos",11,{"$nulls":12},0]
[null,null,12,{"$nulls":12},0]
[null,null,14,{"$nulls":12},0]
[null,null,15,{"$nulls":12},0]
[null,null,16,{"$nulls":12},0]
[null,null,17,{"$nulls":12},0]
[null,null,25,{"$nulls":12},0]
[null,null,26,{"$nulls":12},0]
[null,null,27,{"$nulls":12},0]
[523,"Cámaras fotográficas y de video",11,{"$nulls":12},0]
[null,null,12,{"$nulls":12},0]
[null,null,15,{"$nulls":12},0]
[null,null,16,{"$nulls":12},0]
[null,null,17,{"$nulls":12},0]
[null,null,25,{"$nulls":12},0]
[null,null,26,{"$nulls":12},0]
[null,null,27,{"$nulls":12},0]
[529,"Otro mobiliario y equipo educacional y recreativo ",11,{"$nulls":12},0]
[null,null,12,{"$nulls":12},0]
[null,null,14,{"$nulls":12},0]
[null,null,15,{"$nulls":12},0]
[null,null,16,{"$nulls":12},0]
[null,null,17,{"$nulls":12},0]
[null,null,25,{"$nulls":12},0]
[null,null,26,{"$nulls":12},0]
[null,null,27,{"$nulls":12},0]
[5300,"EQUIPO E INSTRUMENTAL MÉDICO Y DE LABORATORIO",null,{"$f":"SUM(D1174:D1191)","v":0},{"$f":"SUM(E1174:E1191)","v":0},0,0,0,0,0,0,0,0,0,0,0]
[531,"Equipo médico y de laboratorio",11,{"$nulls":12},{"$f":"SUM(D1174:O1174)","v":0}]
[null,null,12,{"$nulls":12},{"$f":"SUM(D1175:O1175)","v":0}]
[null,null,14,{"$nulls":12},0]
[null,null,15,{"$nulls":12},0]
[null,null,16,{"$nulls":12},0]
[null,null,17,{"$nulls":12},0]
[null,null,25,{"$nulls":12},0]
[null,null,26,{"$nulls":12},0]
[null,null,27,{"$nulls":12},0]
[532,"Instrumental médico y de laboratorio",11,{"$nulls":12},0]
[null,null,12,{"$nulls":12},0]
[null,null,14,{"$nulls":12},0]
[null,null,15,{"$nulls":12},0]
[null,null,16,{"$nulls":12},0]
[null,null,17,{"$nulls":12},0]
[null,null,25,{"$nulls":12},0]
[null,null,26,{"$nulls":12},0]
[null,null,27,{"$nulls":12},0]
[5400,"VEHÍCULOS Y EQUIPO DE TRANSPORTE",null,{"$f":"SUM(D1193:D1246)","v":0},{"$f":"SUM(E1193:E1246)","v":0},0,0,0,0,0,0,0,0,0,0,0]
[541,"Vehículos y equipo terrestre",11,{"$nulls":12},{"$f":"SUM(D1193:O1193)","v":0}]
[null,null,12,{"$nulls":12},0]
[null,null,14,{"$nulls":12},0]
[null,null,15,{"$nulls":12},0]
[null,null,16,{"$nulls":12},0]
[null,null,17,{"$nulls":12},0]
[null,null,25,{"$nulls":12},0]
[null,null,26,{"$nulls":12},0]
[null,null,27,{"$nulls":12},0]
[542,"Carrocerías  y remolques",11,{"$nulls":12},0]
[null,null,12,{"$nulls":12},0]
[null,null,14,{"$nulls":12},0]
[null,null,15,{"$nulls":12},0]
[null,null,16,{"$nulls":12},0]
[null,null,17,{"$nulls":12},0]
[null,null,25,{"$nulls":12},0]
[null,null,26,{"$nulls":12},0]
[null,null,27,{"$nulls":12},0]
[543,"Equipo aeroespacial",11,{"$nulls":12},0]
[null,null,12,{"$nulls":12},0]
[null,null,14,{"$nulls":12},0]
[null,null,15,{"$nulls":12},0]
[null,null,16,{"$nulls":12},0]
[null,null,17,{"$nulls":12},0]
[null,null,25,{"$nulls":12},0]
[null,null,26,{"$nulls":12},0]
[null,null,27,{"$nulls":12},0]
[544,"Equipo ferroviario",11,{"$nulls":12},0]
[null,null,12,{"$nulls":12},0]
[null,null,14,{"$nulls":12},0]
[null,null,15,{"$nulls":12},0]
[null,null,16,{"$nulls":12},0]
[null,null,17,{"$nulls":12},0]
[null,null,25,{"$nulls":12},0]
[null,null,26,{"$nulls":12},0]
[null,null,27,{"$nulls":12},0]
[545,"Embarcaciones",11,{"$nulls":12},0]
[null,null,12,{"$nulls":12},0]
[null,null,14,{"$nulls":12},0]
[null,null,15,{"$nulls":12},0]
[null,null,16,{"$nulls":12},0]
[null,null,17,{"$nulls":12},0]
[null,null,25,{"$nulls":12},0]
[null,null,26,{"$nulls":12},0]
[null,null,27,{"$nulls":12},0]
[549,"Otros equipo de transporte",11,{"$nulls":12},0]
[null,null,12,{"$nulls":12},0]
[null,null,14,{"$nulls":12},0]
[null,null,15,{"$nulls":12},0]
[null,null,16,{"$nulls":12},0]
[null,null,17,{"$nulls":12},0]
[null,null,25,{"$nulls":12},0]
[null,null,26,{"$nulls":12},0]
[null,null,27,{"$nulls":12},0]
[5500,"EQUIPO DE DEFENSA Y SEGURIDAD",null,{"$f":"SUM(D1248:D1256)","v":0},{"$f":"SUM(E1248:E1256)","v":0},0,0,0,0,0,0,0,0,0,0,0]
[551,"Equipo de defensa y seguridad",11,{"$nulls":12},{"$f":"SUM(D1248:O1248)","v":0}]
[null,null,12,{"$nulls":12},{"$f":"SUM(D1249:O1249)","v":0}]
[null,null,14,{"$nulls":12},0]
[null,null,15,{"$nulls":12},0]
[null,null,16,{"$nulls":12},0]
[null,null,17,{"$nulls":12},0]
[null,null,25,{"$nulls":12},0]
[null,null,26,{"$nulls":12},0]
[null,null,27,{"$nulls":12},0]
[5600,"MAQUINARIA, OTROS EQUIPOS Y HERRAMIENTAS",null,{"$f":"SUM(D1258:D1329)","v":0},{"$f":"SUM(E1258:E1329)","v":0},0,0,0,0,0,0,0,0,0,0,0]
[561,"Maquinaria y equipo agropecuario",11,{"$nulls":12},{"$f":"SUM(D1258:O1258)","v":0}]
[null,null,12,{"$nulls":12},0]
[null,null,14,{"$nulls":12},0]
[null,null,15,{"$nulls":12},0]
[null,null,16,{"$nulls":12},0]
[null,null,17,{"$nulls":12},0]
[null,null,25,{"$nulls":12},0]
[null,null,26,{"$nulls":12},0]
[null,null,27,{"$nulls":12},0]
[562,"Maquinaria y equipo industrial",11,{"$nulls":12},0]
[null,null,12,{"$nulls":12},0]
[null,null,14,{"$nulls":12},0]
[null,null,15,{"$nulls":12},0]
[null,null,16,{"$nulls":12},0]
[null,null,17,{"$nulls":12},0]
[null,null,25,{"$nulls":12},0]
[null,null,26,{"$nulls":12},0]
[null,null,27,{"$nulls":12},0]
[563,"Maquinaria y equipo de construcción",11,{"$nulls":12},0]
[null,null,12,{"$nulls":12},0]
[null,null,14,{"$nulls":12},0]
[null,null,15,{"$nulls":12},0]
[null,null,16,{"$nulls":12},0]
[null,null,17,{"$nulls":12},0]
[null,null,25,{"$nulls":12},0]
[null,null,26,{"$nulls":12},0]
[null,null,27,{"$nulls":12},0]
[564,"Sistemas de aire acondicionado, calefacción y de refrigeración industrial y comercial",11,{"$nulls":12},0]
[null,null,12,{"$nulls":12},0]
[null,null,14,{"$nulls":12},0]
[null,null,15,{"$nulls":12},0]
[null,null,16,{"$nulls":12},0]
[null,null,17,{"$nulls":12},0]
[null,null,25,{"$nulls":12},0]
[null,null,26,{"$nulls":12},0]
[null,null,27,{"$nulls":12},0]
[565,"Equipo de comunicación y telecomunicación",11,{"$nulls":12},0]
[null,null,12,{"$nulls":12},0]
[null,null,14,{"$nulls":12},0]
[null,null,15,{"$nulls":12},0]
[null,null,16,{"$nulls":12},0]
[null,null,17,{"$nulls":12},0]
[null,null,25,{"$nulls":12},0]
[null,null,26,{"$nulls":12},0]
[null,null,27,{"$nulls":12},0]
[566,"Equipo de generación eléctrica, aparatos y accesorios eléctricos",11,{"$nulls":12},0]
[null,null,12,{"$nulls":12},0]
[null,null,14,{"$nulls":12},0]
[null,null,15,{"$nulls":12},0]
[null,null,16,{"$nulls":12},0]
[null,null,17,{"$nulls":12},0]
[null,null,25,{"$nulls":12},0]
[null,null,26,{"$nulls":12},0]
[null,null,27,{"$nulls":12},0]
[567,"Herramientas y máquinas-herramienta",11,{"$nulls":12},0]
[null,null,12,{"$nulls":12},0]
[null,null,14,{"$nulls":12},0]
[null,null,15,{"$nulls":12},0]
[null,null,16,{"$nulls":12},0]
[null,null,17,{"$nulls":12},0]
[null,null,25,{"$nulls":12},0]
[null,null,26,{"$nulls":12},0]
[null,null,27,{"$nulls":12},0]
[569,"Otros equipos",11,{"$nulls":12},0]
[null,null,12,{"$nulls":12},0]
[null,null,14,{"$nulls":12},0]
[null,null,15,{"$nulls":12},0]
[null,null,16,{"$nulls":12},0]
[null,null,17,{"$nulls":12},0]
[null,null,25,{"$nulls":12},0]
[null,null,26,{"$nulls":12},0]
[null,null,27,{"$nulls":12},0]
[5700,"ACTIVOS BIOLÓGICOS",null,{"$f":"SUM(D1331:D1411)","v":0},{"$f":"SUM(E1331:E1411)","v":0},0,0,0,0,0,0,0,0,0,0,0]
[571,"Bovinos",11,{"$nulls":12},{"$f":"SUM(D1331:O1331)","v":0}]
[null,null,12,{"$nulls":12},0]
[null,null,14,{"$nulls":12},0]
[null,null,15,{"$nulls":12},0]
[null,null,16,{"$nulls":12},0]
[null,null,17,{"$nulls":12},0]
[null,null,25,{"$nulls":12},0]
[null,null,26,{"$nulls":12},0]
[null,null,27,{"$nulls":12},0]
[572,"Porcinos",11,{"$nulls":12},0]
[null,null,12,{"$nulls":12},0]
[null,null,14,{"$nulls":12},0]
[null,null,15,{"$nulls":12},0]
[null,null,16,{"$nulls":12},0]
[null,null,17,{"$nulls":12},0]
[null,null,25,{"$nulls":12},0]
[null,null,26,{"$nulls":12},0]
[null,null,27,{"$nulls":12},0]
[573,"Aves",11,{"$nulls":12},0]
[null,null,12,{"$nulls":12},0]
[null,null,14,{"$nulls":12},0]
[null,null,15,{"$nulls":12},0]
[null,null,16,{"$nulls":12},0]
[null,null,17,{"$nulls":12},0]
[null,null,25,{"$nulls":12},0]
[null,null,26,{"$nulls":12},0]
[null,null,27,{"$nulls":12},0]
[574,"Ovinos y caprinos ",11,{"$nulls":12},0]
[null,null,12,{"$nulls":12},0]
[null,null,14,{"$nulls":12},0]
[null,null,15,{"$nulls":12},0]
[null,null,16,{"$nulls":12},0]
[null,null,17,{"$nulls":12},0]
[null,null,25,{"$nulls":12},0]
[null,null,26,{"$nulls":12},0]
[null,null,27,{"$nulls":12},0]
[575,"Peces y acuicultura",11,{"$nulls":12},0]
[null,null,12,{"$nulls":12},0]
[null,null,14,{"$nulls":12},0]
[null,null,15,{"$nulls":12},0]
[null,null,16,{"$nulls":12},0]
[null,null,17,{"$nulls":12},0]
[null,null,25,{"$nulls":12},0]
[null,null,26,{"$nulls":12},0]
[null,null,27,{"$nulls":12},0]
[576,"Equinos",11,{"$nulls":12},0]
[null,null,12,{"$nulls":12},0]
[null,null,14,{"$nulls":12},0]
[null,null,15,{"$nulls":12},0]
[null,null,16,{"$nulls":12},0]
[null,null,17,{"$nulls":12},0]
[null,null,25,{"$nulls":12},0]
[null,null,26,{"$nulls":12},0]
[null,null,27,{"$nulls":12},0]
[577,"Especies menores y de zoológico",11,{"$nulls":12},0]
[null,null,12,{"$nulls":12},0]
[null,null,14,{"$nulls":12},0]
[null,null,15,{"$nulls":12},0]
[null,null,16,{"$nulls":12},0]
[null,null,17,{"$nulls":12},0]
[null,null,25,{"$nulls":12},0]
[null,null,26,{"$nulls":12},0]
[null,null,27,{"$nulls":12},0]
[578,"Árboles y plantas",11,{"$nulls":12},0]
[null,null,12,{"$nulls":12},0]
[null,null,14,{"$nulls":12},0]
[null,null,15,{"$nulls":12},0]
[null,null,16,{"$nulls":12},0]
[null,null,17,{"$nulls":12},0]
[null,null,25,{"$nulls":12},0]
[null,null,26,{"$nulls":12},0]
[null,null,27,{"$nulls":12},0]
[579,"Otros activos biológicos",11,{"$nulls":12},0]
[null,null,12,{"$nulls":12},{"$f":"SUM(D1404:O1404)","v":0}]
[null,null,14,{"$nulls":12},0]
[null,null,15,{"$nulls":12},0]
[null,null,16,{"$nulls":12},0]
[null,null,17,{"$nulls":12},0]
[null,null,25,{"$nulls":12},0]
[null,null,26,{"$nulls":12},0]
[null,null,27,{"$nulls":12},0]
[5800,"BIENES INMUEBLES",null,{"$f":"SUM(D1413:D1448)","v":0},{"$f":"SUM(E1413:E1448)","v":0},0,0,0,0,0,0,0,0,0,0,0]
[581,"Terrenos",11,{"$nulls":12},{"$f":"SUM(D1413:O1413)","v":0}]
[null,null,12,{"$nulls":12},{"$f":"SUM(D1414:O1414)","v":0}]
[null,null,14,{"$nulls":12},0]
[null,null,15,{"$nulls":12},0]
[null,null,16,{"$nulls":12},0]
[null,null,17,{"$nulls":12},0]
[null,null,25,{"$nulls":12},0]
[null,null,26,{"$nulls":12},0]
[null,null,27,{"$nulls":12},0]
[582,"Viviendas ",11,{"$nulls":12},0]
[null,null,12,{"$nulls":12},0]
[null,null,14,{"$nulls":12},0]
[null,null,15,{"$nulls":12},0]
[null,null,16,{"$nulls":12},0]
[null,null,17,{"$nulls":12},0]
[null,null,25,{"$nulls":12},0]
[null,null,26,{"$nulls":12},0]
[null,null,27,{"$nulls":12},0]
[583,"Edificios no residenciales",11,{"$nulls":12},0]
[null,null,12,{"$nulls":12},0]
[null,null,14,{"$nulls":12},0]
[null,null,15,{"$nulls":12},0]
[null,null,16,{"$nulls":12},0]
[null,null,17,{"$nulls":12},0]
[null,null,25,{"$nulls":12},0]
[null,null,26,{"$nulls":12},0]
[null,null,27,{"$nulls":12},0]
[589,"Otros bienes inmuebles",11,{"$nulls":12},0]
[null,null,12,{"$nulls":12},0]
[null,null,14,{"$nulls":12},0]
[null,null,15,{"$nulls":12},0]
[null,null,16,{"$nulls":12},0]
[null,null,17,{"$nulls":12},0]
[null,null,25,{"$nulls":12},0]
[null,null,26,{"$nulls":12},0]
[null,null,27,{"$nulls":12},0]
[5900,"ACTIVOS INTANGIBLES",null,{"$f":"SUM(D1450:D1530)","v":0},{"$f":"SUM(E1450:E1530)","v":0},0,0,0,0,0,0,0,0,0,0,0]
[591,"Software",11,{"$nulls":12},{"$f":"SUM(D1450:O1450)","v":0}]
[null,null,12,{"$nulls":12},0]
[null,null,14,{"$nulls":12},0]
[null,null,15,{"$nulls":12},0]
[null,null,16,{"$nulls":12},0]
[null,null,17,{"$nulls":12},0]
[null,null,25,{"$nulls":12},0]
[null,null,26,{"$nulls":12},0]
[null,null,27,{"$nulls":12},0]
[592,"Patentes",11,{"$nulls":12},0]
[null,null,12,{"$nulls":12},0]
[null,null,14,{"$nulls":12},0]
[null,null,15,{"$nulls":12},0]
[null,null,16,{"$nulls":12},0]
[null,null,17,{"$nulls":12},0]
[null,null,25,{"$nulls":12},0]
[null,null,26,{"$nulls":12},0]
[null,null,27,{"$nulls":12},0]
[593,"Marcas",11,{"$nulls":12},0]
[null,null,12,{"$nulls":12},0]
[null,null,14,{"$nulls":12},0]
[null,null,15,{"$nulls":12},0]
[null,null,16,{"$nulls":12},0]
[null,null,17,{"$nulls":12},0]
[null,null,25,{"$nulls":12},0]
[null,null,26,{"$nulls":12},0]
[null,null,27,{"$nulls":12},0]
[594,"Derechos",11,{"$nulls":12},0]
[null,null,12,{"$nulls":12},0]
[null,null,14,{"$nulls":12},0]
[null,null,15,{"$nulls":12},0]
[null,null,16,{"$nulls":12},0]
[null,null,17,{"$nulls":12},0]
[null,null,25,{"$nulls":12},0]
[null,null,26,{"$nulls":12},0]
[null,null,27,{"$nulls":12},0]
[595,"Concesiones",11,{"$nulls":12},0]
[null,null,12,{"$nulls":12},0]
[null,null,14,{"$nulls":12},0]
[null,null,15,{"$nulls":12},0]
[null,null,16,{"$nulls":12},0]
[null,null,17,{"$nulls":12},0]
[null,null,25,{"$nulls":12},0]
[null,null,26,{"$nulls":12},0]
[null,null,27,{"$nulls":12},0]
[596,"Franquicias",11,{"$nulls":12},0]
[null,null,12,{"$nulls":12},0]
[null,null,14,{"$nulls":12},0]
[null,null,15,{"$nulls":12},0]
[null,null,16,{"$nulls":12},0]
[null,null,17,{"$nulls":12},0]
[null,null,25,{"$nulls":12},0]
[null,null,26,{"$nulls":12},0]
[null,null,27,{"$nulls":12},0]
[597,"Licencias informáticas e intelectuales",11,{"$nulls":12},0]
[null,null,12,{"$nulls":12},0]
[null,null,14,{"$nulls":12},0]
[null,null,15,{"$nulls":12},0]
[null,null,16,{"$nulls":12},0]
[null,null,17,{"$nulls":12},0]
[null,null,25,{"$nulls":12},0]
[null,null,26,{"$nulls":12},0]
[null,null,27,{"$nulls":12},0]
[598,"Licencias industriales, comerciales y otras",11,{"$nulls":12},0]
[null,null,12,{"$nulls":12},0]
[null,null,14,{"$nulls":12},0]
[null,null,15,{"$nulls":12},0]
[null,null,16,{"$nulls":12},0]
[null,null,17,{"$nulls":12},0]
[null,null,25,{"$nulls":12},0]
[null,null,26,{"$nulls":12},0]
[null,null,27,{"$nulls":12},0]
[599,"Otros activos intangibles",11,{"$nulls":12},0]
[null,null,12,{"$nulls":12},{"$f":"SUM(D1523:O1523)","v":0}]
[null,null,14,{"$nulls":12},0]
[null,null,15,{"$nulls":12},0]
[null,null,16,{"$nulls":12},0]
[null,null,17,{"$nulls":12},0]
[null,null,25,{"$nulls":12},0]
[null,null,26,{"$nulls":12},0]
[null,null,27,{"$nulls":12},0]
[6000,"INVERSIÓN PÚBLICA",null,{"$f":"D1532+D1605+D1678","v":0},0,0,0,0,0,0,0,0,0,0,0,0]
[6100,"OBRA PÚBLICA EN BIENES DE DOMINIO PÚBLICO",null,{"$f":"SUM(D1533:D1596)","v":0},{"$f":"SUM(E1533:E1596)","v":0},{"$f":"SUM(F1533:F1604)","v":0},0,0,0,0,0,0,0,0,0,0]
[611,"Edificación habitacional",11,{"$nulls":12},{"$f":"SUM(D1533:O1533)","v":0}]
[null,null,12,{"$nulls":12},0]
[null,null,14,{"$nulls":12},0]
[null,null,15,{"$nulls":12},0]
[null,null,16,{"$nulls":12},0]
[null,null,17,{"$nulls":12},0]
[null,null,25,{"$nulls":12},0]
[null,null,26,{"$nulls":12},0]
[null,null,27,{"$nulls":12},0]
[612,"Edificación no  habitacional",11,{"$nulls":12},0]
[null,null,12,{"$nulls":12},0]
[null,null,14,{"$nulls":12},0]
[null,null,15,{"$nulls":12},0]
[null,null,16,{"$nulls":12},0]
[null,null,17,{"$nulls":12},0]
[null,null,25,{"$nulls":12},0]
[null,null,26,{"$nulls":12},0]
[null,null,27,{"$nulls":12},0]
[613,"Construcción de obras para el abastecimiento de agua, petróleo, gas, electricidad y telecomunicaciones",11,{"$nulls":12},0]
[null,null,12,{"$nulls":12},0]
[null,null,14,{"$nulls":12},0]
[null,null,15,{"$nulls":12},0]
[null,null,16,{"$nulls":12},0]
[null,null,17,{"$nulls":12},0]
[null,null,25,{"$nulls":12},0]
[null,null,26,{"$nulls":12},0]
[null,null,27,{"$nulls":12},0]
[614,"División de terrenos y construcción de obras de urbanización",11,{"$nulls":12},0]
[null,null,12,{"$nulls":12},0]
[null,null,14,{"$nulls":12},0]
[null,null,15,{"$nulls":12},0]
[null,null,16,{"$nulls":12},0]
[null,null,17,{"$nulls":12},0]
[null,null,25,{"$nulls":12},0]
[null,null,26,{"$nulls":12},0]
[null,null,27,{"$nulls":12},0]
[615,"Construcción de vías de comunicación",11,{"$nulls":12},0]
[null,null,12,{"$nulls":12},0]
[null,null,14,{"$nulls":12},0]
[null,null,15,{"$nulls":12},0]
[null,null,16,{"$nulls":12},0]
[null,null,17,{"$nulls":12},0]
[null,null,25,{"$nulls":12},0]
[null,null,26,{"$nulls":12},0]
[null,null,27,{"$nulls":12},0]
[616,"Otras construcciones de ingeniería civil u obra pesada",11,{"$nulls":12},0]
[null,null,12,{"$nulls":12},0]
[null,null,14,{"$nulls":12},0]
[null,null,15,{"$nulls":12},0]
[null,null,16,{"$nulls":12},0]
[null,null,17,{"$nulls":12},0]
[null,null,25,{"$nulls":12},0]
[null,null,26,{"$nulls":12},0]
[null,null,27,{"$nulls":12},0]
[617,"Instalaciones y equipamiento en construcciones",11,{"$nulls":12},0]
[null,null,12,{"$nulls":12},0]
[null,null,14,{"$nulls":12},0]
[null,null,15,{"$nulls":12},0]
[null,null,16,{"$nulls":12},0]
[null,null,17,{"$nulls":12},0]
[null,null,25,{"$nulls":12},0]
[null,null,26,{"$nulls":12},0]
[null,null,27,{"$nulls":12},0]
[619,"Trabajo de acabados en edificaciones y otros trabajos especializados",11,{"$nulls":12},0]
[null,null,12,{"$nulls":12},0]
[null,null,14,{"$nulls":12},0]
[null,null,15,{"$nulls":12},0]
[null,null,16,{"$nulls":12},0]
[null,null,17,{"$nulls":12},0]
[null,null,25,{"$nulls":12},0]
[null,null,26,{"$nulls":12},0]
[null,null,27,{"$nulls":12},0]
[6200,"OBRA PÚBLICA EN BIENES PROPIOS",null,{"$f":"SUM(D1606:D1677)","v":0},{"$f":"SUM(E1606:E1677)","v":0},0,0,0,0,0,0,0,0,0,0,0]
[621,"Edificación habitacional",11,{"$nulls":12},{"$f":"SUM(D1606:O1606)","v":0}]
[null,null,12,{"$nulls":12},0]
[null,null,14,{"$nulls":12},0]
[null,null,15,{"$nulls":12},0]
[null,null,16,{"$nulls":12},0]
[null,null,17,{"$nulls":12},0]
[null,null,25,{"$nulls":12},0]
[null,null,26,{"$nulls":12},0]
[null,null,27,{"$nulls":12},0]
[622,"Edificación no habitacional",11,{"$nulls":12},0]
[null,null,12,{"$nulls":12},0]
[null,null,14,{"$nulls":12},0]
[null,null,15,{"$nulls":12},0]
[null,null,16,{"$nulls":12},0]
[null,null,17,{"$nulls":12},0]
[null,null,25,{"$nulls":12},0]
[null,null,26,{"$nulls":12},0]
[null,null,27,{"$nulls":12},0]
[623,"Construcción de obras para  el abastecimiento de agua,  petróleo, gas, electricidad y telecomunicaciones",11,{"$nulls":12},0]
[null,null,12,{"$nulls":12},0]
[null,null,14,{"$nulls":12},0]
[null,null,15,{"$nulls":12},0]
[null,null,16,{"$nulls":12},0]
[null,null,17,{"$nulls":12},0]
[null,null,25,{"$nulls":12},0]
[null,null,26,{"$nulls":12},0]
[null,null,27,{"$nulls":12},0]
[624,"División de terrenos y construcción de obras de urbanización",11,{"$nulls":12},0]
[null,null,12,{"$nulls":12},0]
[null,null,14,{"$nulls":12},0]
[null,null,15,{"$nulls":12},0]
[null,null,16,{"$nulls":12},0]
[null,null,17,{"$nulls":12},0]
[null,null,25,{"$nulls":12},0]
[null,null,26,{"$nulls":12},0]
[null,null,27,{"$nulls":12},0]
[625,"Construcción de vías de comunicación",11,{"$nulls":12},0]
[null,null,12,{"$nulls":12},0]
[null,null,14,{"$nulls":12},0]
[null,null,15,{"$nulls":12},0]
[null,null,16,{"$nulls":12},0]
[null,null,17,{"$nulls":12},0]
[null,null,25,{"$nulls":12},0]
[null,null,26,{"$nulls":12},0]
[null,null,27,{"$nulls":12},0]
[626,"Otras construcciones de ingeniería civil u obra pesada",11,{"$nulls":12},0]
[null,null,12,{"$nulls":12},0]
[null,null,14,{"$nulls":12},0]
[null,null,15,{"$nulls":12},0]
[null,null,16,{"$nulls":12},0]
[null,null,17,{"$nulls":12},0]
[null,null,25,{"$nulls":12},0]
[null,null,26,{"$nulls":12},0]
[null,null,27,{"$nulls":12},0]
[627,"Instalaciones y equipamiento en construcciones",11,{"$nulls":12},0]
[null,null,12,{"$nulls":12},0]
[null,null,14,{"$nulls":12},0]
[null,null,15,{"$nulls":12},0]
[null,null,16,{"$nulls":12},0]
[null,null,17,{"$nulls":12},0]
[null,null,25,{"$nulls":12},0]
[null,null,26,{"$nulls":12},0]
[null,null,27,{"$nulls":12},0]
[629,"Trabajos de acabados en edificaciones y otros trabajos especializados",11,{"$nulls":12},0]
[null,null,12,{"$nulls":12},0]
[null,null,14,{"$nulls":12},0]
[null,null,15,{"$nulls":12},0]
[null,null,16,{"$nulls":12},0]
[null,null,17,{"$nulls":12},0]
[null,null,25,{"$nulls":12},0]
[null,null,26,{"$nulls":12},0]
[null,null,27,{"$nulls":12},0]
[6300,"PROYECTOS PRODUCTIVOS Y ACCIONES DE FOMENTO",null,{"$f":"SUM(D1679:D1696)","v":0},{"$f":"SUM(E1679:E1696)","v":0},0,0,0,0,0,0,0,0,0,0,0]
[631,"Estudios, formulación y evaluación de proyectos productivos no incluidos en conceptos anteriores de este capítulo",11,{"$nulls":12},{"$f":"SUM(D1679:O1679)","v":0}]
[null,null,12,{"$nulls":12},{"$f":"SUM(D1680:O1680)","v":0}]
[null,null,14,{"$nulls":12},0]
[null,null,15,{"$nulls":12},0]
[null,null,16,{"$nulls":12},0]
[null,null,17,{"$nulls":12},0]
[null,null,25,{"$nulls":12},0]
[null,null,26,{"$nulls":12},0]
[null,null,27,{"$nulls":12},0]
[632,"Ejecución de proyectos productivos no incluidos en conceptos anteriores de este capítulo",11,{"$nulls":12},0]
[null,null,12,{"$nulls":12},0]
[null,null,14,{"$nulls":12},0]
[null,null,15,{"$nulls":12},0]
[null,null,16,{"$nulls":12},0]
[null,null,17,{"$nulls":12},0]
[null,null,25,{"$nulls":12},0]
[null,null,26,{"$nulls":12},0]
[null,null,27,{"$nulls":12},0]
[7000,"INVERSIONES FINANCIERAS Y OTRAS PROVISIONES",null,{"$f":"D1698+D1709+D1775+D1824+D1876+D1914+D1931","v":0},0,0,0,0,0,0,0,0,0,0,0,0]
[7100,"INVERSIONES PARA EL FOMENTO DE ACTIVIDADES PRODUCTIVAS",null,{"$f":"SUM(D1699:D1708)","v":0},{"$f":"SUM(E1699:E1708)","v":0},0,0,0,0,0,0,0,0,0,0,0]
[711,"Créditos otorgados por entidades federativas y municipios al sector social y privado para el fomento de actividades productivas",11,{"$nulls":12},{"$f":"SUM(D1699:O1699)","v":0}]
[null,null,12,{"$nulls":12},{"$f":"SUM(D1700:O1700)","v":0}]
[null,null,14,{"$nulls":12},0]
[null,null,15,{"$nulls":12},0]
[null,null,16,{"$nulls":12},0]
[null,null,17,{"$nulls":12},0]
[null,null,25,{"$nulls":12},0]
[null,null,26,{"$nulls":12},0]
[null,null,27,{"$nulls":12},0]
[712,"Créditos otorgados por las entidades federativas a municipios para el fomento de actividades productivas",{"$nulls":13},{"$f":"SUM(D1708:O1708)","v":0}]
[7200,"ACCIONES Y PARTICIPACIONES DE CAPITAL",null,{"$f":"SUM(D1710:D1774)","v":0},{"$f":"SUM(E1710:E1774)","v":0},0,0,0,0,0,0,0,0,0,0,0]
[721,"Acciones y participaciones de capital en entidades paraestatales no empresariales y no financieras con fines de política económica",11,{"$nulls":12},{"$f":"SUM(D1710:O1710)","v":0}]
[null,null,12,{"$nulls":12},0]
[null,null,14,{"$nulls":12},0]
[null,null,15,{"$nulls":12},0]
[null,null,16,{"$nulls":12},0]
[null,null,17,{"$nulls":12},0]
[null,null,25,{"$nulls":12},0]
[null,null,26,{"$nulls":12},0]
[null,null,27,{"$nulls":12},0]
[722,"Acciones y participaciones de capital en entidades paraestatales empresariales y no financieras con fines de política económica",{"$nulls":13},0]
[723,"Acciones  y participaciones de capital en instituciones paraestatales públicas financieras con fines de política económica",{"$nulls":13},0]
[724,"Acciones y participaciones  de capital en el sector privado con fines de política económica",11,{"$nulls":12},0]
[null,null,12,{"$nulls":12},0]
[null,null,14,{"$nulls":12},0]
[null,null,15,{"$nulls":12},0]
[null,null,16,{"$nulls":12},0]
[null,null,17,{"$nulls":12},0]
[null,null,25,{"$nulls":12},0]
[null,null,26,{"$nulls":12},0]
[null,null,27,{"$nulls":12},0]
[725,"Acciones y participaciones de capital en organismos internacionales con fines de política económica",11,{"$nulls":12},0]
[null,null,12,{"$nulls":12},0]
[null,null,14,{"$nulls":12},0]
[null,null,15,{"$nulls":12},0]
[null,null,16,{"$nulls":12},0]
[null,null,17,{"$nulls":12},0]
[null,null,25,{"$nulls":12},0]
[null,null,26,{"$nulls":12},0]
[null,null,27,{"$nulls":12},0]
[726,"Acciones y participaciones de capital en el sector externo con fines de política económica",11,{"$nulls":12},0]
[null,null,12,{"$nulls":12},0]
[null,null,14,{"$nulls":12},0]
[null,null,15,{"$nulls":12},0]
[null,null,16,{"$nulls":12},0]
[null,null,17,{"$nulls":12},0]
[null,null,25,{"$nulls":12},0]
[null,null,26,{"$nulls":12},0]
[null,null,27,{"$nulls":12},0]
[727,"Acciones y participaciones de capital en el sector público con fines de gestión de la liquidez",11,{"$nulls":12},0]
[null,null,12,{"$nulls":12},0]
[null,null,14,{"$nulls":12},0]
[null,null,15,{"$nulls":12},0]
[null,null,16,{"$nulls":12},0]
[null,null,17,{"$nulls":12},0]
[null,null,25,{"$nulls":12},0]
[null,null,26,{"$nulls":12},0]
[null,null,27,{"$nulls":12},0]
[728,"Acciones y participaciones de capital  en el sector privado con fines de gestión de liquidez",11,{"$nulls":12},0]
[null,null,12,{"$nulls":12},0]
[null,null,14,{"$nulls":12},0]
[null,null,15,{"$nulls":12},0]
[null,null,16,{"$nulls":12},0]
[null,null,17,{"$nulls":12},0]
[null,null,25,{"$nulls":12},0]
[null,null,26,{"$nulls":12},0]
[null,null,27,{"$nulls":12},0]
[729,"Acciones y participaciones de capital en el sector externo con fines de gestión  de liquidez",11,{"$nulls":12},0]
[null,null,12,{"$nulls":12},0]
[null,null,14,{"$nulls":12},0]
[null,null,15,{"$nulls":12},0]
[null,null,16,{"$nulls":12},0]
[null,null,17,{"$nulls":12},0]
[null,null,25,{"$nulls":12},0]
[null,null,26,{"$nulls":12},0]
[null,null,27,{"$nulls":12},0]
[7300,"COMPRA DE TÍTULOS Y VALORES",null,{"$f":"SUM(D1776:D1823)","v":0},0,0,0,0,0,0,0,0,0,0,0,0]
[731,"Bonos",11,{"$nulls":12},{"$f":"SUM(D1776:O1776)","v":0}]
[null,null,14,{"$nulls":12},0]
[null,null,15,{"$nulls":12},0]
[null,null,16,{"$nulls":12},0]
[null,null,17,{"$nulls":12},0]
[null,null,25,{"$nulls":12},0]
[null,null,26,{"$nulls":12},0]
[null,null,27,{"$nulls":12},0]
[732,"Valores representativos de deuda adquiridos con fines de política económica",11,{"$nulls":12},0]
[null,null,14,{"$nulls":12},0]
[null,null,15,{"$nulls":12},0]
[null,null,16,{"$nulls":12},0]
[null,null,17,{"$nulls":12},0]
[null,null,25,{"$nulls":12},0]
[null,null,26,{"$nulls":12},0]
[null,null,27,{"$nulls":12},0]
[733,"Valores representativos de deuda  adquiridos con fines de gestión de liquidez",11,{"$nulls":12},0]
[null,null,14,{"$nulls":12},0]
[null,null,15,{"$nulls":12},0]
[null,null,16,{"$nulls":12},0]
[null,null,17,{"$nulls":12},0]
[null,null,25,{"$nulls":12},0]
[null,null,26,{"$nulls":12},0]
[null,null,27,{"$nulls":12},0]
[734,"Obligaciones negociables adquiridas con fines de política económica",11,{"$nulls":12},0]
[null,null,14,{"$nulls":12},0]
[null,null,15,{"$nulls":12},0]
[null,null,16,{"$nulls":12},0]
[null,null,17,{"$nulls":12},0]
[null,null,25,{"$nulls":12},0]
[null,null,26,{"$nulls":12},0]
[null,null,27,{"$nulls":12},0]
[735,"Obligaciones negociables adquiridas con fines de gestión de liquidez",11,{"$nulls":12},0]
[null,null,14,{"$nulls":12},0]
[null,null,15,{"$nulls":12},0]
[null,null,16,{"$nulls":12},0]
[null,null,17,{"$nulls":12},0]
[null,null,25,{"$nulls":12},0]
[null,null,26,{"$nulls":12},0]
[null,null,27,{"$nulls":12},0]
[739,"Otros valores",11,{"$nulls":12},0]
[null,null,14,{"$nulls":12},0]
[null,null,15,{"$nulls":12},0]
[null,null,16,{"$nulls":12},0]
[null,null,17,{"$nulls":12},0]
[null,null,25,{"$nulls":12},0]
[null,null,26,{"$nulls":12},0]
[null,null,27,{"$nulls":12},0]
[7400,"CONCESIÓN DE PRÉSTAMOS",null,{"$f":"SUM(D1825:D1875)","v":0},{"$f":"SUM(E1825:E1875)","v":0},0,0,0,0,0,0,0,0,0,0,0]
[741,"Concesión de préstamos a entidades paraestatales no empresariales y no financieras con fines de política económica",11,{"$nulls":12},{"$f":"SUM(D1825:O1825)","v":0}]
[null,null,14,{"$nulls":12},0]
[null,null,15,{"$nulls":12},0]
[null,null,16,{"$nulls":12},0]
[null,null,17,{"$nulls":12},0]
[null,null,25,{"$nulls":12},0]
[null,null,26,{"$nulls":12},0]
[null,null,27,{"$nulls":12},0]
[742,"Concesión de préstamos a entidades paraestatales empresariales y no financieras con fines de política económica",{"$nulls":13},0]
[743,"Concesión de préstamos a instituciones paraestatales públicas financieras con fines de política económica",{"$nulls":13},0]
[744,"Concesión de préstamos a entidades federativas  y municipios con fines de política económica",{"$nulls":13},0]
[745,"Concesión de préstamos al sector privado con fines de política económica",11,{"$nulls":12},0]
[null,null,14,{"$nulls":12},0]
[null,null,15,{"$nulls":12},0]
[null,null,16,{"$nulls":12},0]
[null,null,17,{"$nulls":12},0]
[null,null,25,{"$nulls":12},0]
[null,null,26,{"$nulls":12},0]
[null,null,27,{"$nulls":12},0]
[746,"Concesión de préstamos al sector externo con fines de política económica",11,{"$nulls":12},0]
[null,null,14,{"$nulls":12},0]
[null,null,15,{"$nulls":12},0]
[null,null,16,{"$nulls":12},0]
[null,null,17,{"$nulls":12},0]
[null,null,25,{"$nulls":12},0]
[null,null,26,{"$nulls":12},0]
[null,null,27,{"$nulls":12},0]
[747,"Concesión de préstamos al sector público con fines de gestión de liquidez",11,{"$nulls":12},0]
[null,null,14,{"$nulls":12},0]
[null,null,15,{"$nulls":12},0]
[null,null,16,{"$nulls":12},0]
[null,null,17,{"$nulls":12},0]
[null,null,25,{"$nulls":12},0]
[null,null,26,{"$nulls":12},0]
[null,null,27,{"$nulls":12},0]
[748,"Concesión de préstamos al sector privado con fines de gestión de liquidez",11,{"$nulls":12},0]
[null,null,14,{"$nulls":12},0]
[null,null,15,{"$nulls":12},0]
[null,null,16,{"$nulls":12},0]
[null,null,17,{"$nulls":12},0]
[null,null,25,{"$nulls":12},0]
[null,null,26,{"$nulls":12},0]
[null,null,27,{"$nulls":12},0]
[749,"Concesión de  préstamos al sector externo con fines de gestión de liquidez",11,{"$nulls":12},0]
[null,null,14,{"$nulls":12},0]
[null,null,15,{"$nulls":12},0]
[null,null,16,{"$nulls":12},0]
[null,null,17,{"$nulls":12},0]
[null,null,25,{"$nulls":12},0]
[null,null,26,{"$nulls":12},0]
[null,null,27,{"$nulls":12},0]
[7500,"INVERSIONES EN FIDEICOMISOS, MANDATOS Y OTROS  ANÁLOGOS",null,{"$f":"SUM(D1877:D1913)","v":0},{"$f":"SUM(E1877:E1913)","v":0},0,0,0,0,0,0,0,0,0,0,0]
[751,"Inversiones en fideicomisos del Poder Ejecutivo",11,{"$nulls":12},{"$f":"SUM(D1877:O1877)","v":0}]
[null,null,14,{"$nulls":12},0]
[null,null,15,{"$nulls":12},0]
[null,null,16,{"$nulls":12},0]
[null,null,17,{"$nulls":12},0]
[null,null,25,{"$nulls":12},0]
[null,null,26,{"$nulls":12},0]
[null,null,27,{"$nulls":12},0]
[752,"Inversiones en fideicomisos del Poder Legislativo",{"$nulls":13},0]
[753,"Inversiones en fideicomisos del Poder Judicial",{"$nulls":13},0]
[754,"Inversiones en fideicomisos públicos no empresariales y no financieros",11,{"$nulls":12},0]
[null,null,14,{"$nulls":12},0]
[null,null,15,{"$nulls":12},0]
[null,null,16,{"$nulls":12},0]
[null,null,17,{"$nulls":12},0]
[null,null,25,{"$nulls":12},0]
[null,null,26,{"$nulls":12},0]
[null,null,27,{"$nulls":12},0]
[755,"Inversiones en fideicomisos públicos empresariales y no financieros",{"$nulls":13},0]
[756,"Inversiones en fideicomisos públicos financieros ",{"$nulls":13},0]
[757,"Inversiones en fideicomisos de entidades federativas",11,{"$nulls":12},0]
[null,null,14,{"$nulls":12},0]
[null,null,15,{"$nulls":12},0]
[null,null,16,{"$nulls":12},0]
[null,null,17,{"$nulls":12},0]
[null,null,25,{"$nulls":12},0]
[null,null,26,{"$nulls":12},0]
[null,null,27,{"$nulls":12},0]
[758,"Inversiones en fideicomisos de municipios",{"$nulls":13},{"$f":"SUM(D1905:O1905)","v":0}]
[759,"Otras inversiones en fideicomisos",11,{"$nulls":12},0]
[null,null,14,{"$nulls":12},0]
[null,null,15,{"$nulls":12},0]
[null,null,16,{"$nulls":12},0]
[null,null,17,{"$nulls":12},0]
[null,null,25,{"$nulls":12},0]
[null,null,26,{"$nulls":12},0]
[null,null,27,{"$nulls":12},0]
[7600,"OTRAS INVERSIONES FINANCIERAS",null,{"$f":"SUM(D1915:D1930)","v":0},{"$f":"SUM(E1915:E1930)","v":0},0,0,0,0,0,0,0,0,0,0,0]
[761,"Depósitos a largo plazo en moneda nacional",11,{"$nulls":12},{"$f":"SUM(D1915:O1915)","v":0}]
[null,null,14,{"$nulls":12},{"$f":"SUM(D1916:O1916)","v":0}]
[null,null,15,{"$nulls":12},0]
[null,null,16,{"$nulls":12},0]
[null,null,17,{"$nulls":12},0]
[null,null,25,{"$nulls":12},0]
[null,null,26,{"$nulls":12},0]
[null,null,27,{"$nulls":12},0]
[762,"Depósitos a largo plazo en moneda extranjera",11,{"$nulls":12},0]
[null,null,14,{"$nulls":12},0]
[null,null,15,{"$nulls":12},0]
[null,null,16,{"$nulls":12},0]
[null,null,17,{"$nulls":12},0]
[null,null,25,{"$nulls":12},0]
[null,null,26,{"$nulls":12},0]
[null,null,27,{"$nulls":12},0]
[7900,"PROVISIONES PARA CONTINGENCIAS Y OTRAS EROGACIONES ESPECIALES",null,{"$f":"SUM(D1932:D1955)","v":0},{"$f":"SUM(E1932:E1955)","v":0},0,0,0,0,0,0,0,0,0,0,0]
[791,"Contingencias por fenómenos naturales",11,{"$nulls":12},{"$f":"SUM(D1932:O1932)","v":0}]
[null,null,14,{"$nulls":12},{"$f":"SUM(D1933:O1933)","v":0}]
[null,null,15,{"$nulls":12},0]
[null,null,16,{"$nulls":12},0]
[null,null,17,{"$nulls":12},0]
[null,null,25,{"$nulls":12},0]
[null,null,26,{"$nulls":12},0]
[null,null,27,{"$nulls":12},0]
[792,"Contingencias socioeconómicas",11,{"$nulls":12},0]
[null,null,14,{"$nulls":12},0]
[null,null,15,{"$nulls":12},0]
[null,null,16,{"$nulls":12},0]
[null,null,17,{"$nulls":12},0]
[null,null,25,{"$nulls":12},0]
[null,null,26,{"$nulls":12},0]
[null,null,27,{"$nulls":12},0]
[799,"Otras erogaciones especiales",11,{"$nulls":12},0]
[null,null,14,{"$nulls":12},0]
[null,null,15,{"$nulls":12},0]
[null,null,16,{"$nulls":12},0]
[null,null,17,{"$nulls":12},0]
[null,null,25,{"$nulls":12},0]
[null,null,26,{"$nulls":12},0]
[null,null,27,{"$nulls":12},0]
[8000,"PARTICIPACIONES Y APORTACIONES",null,{"$f":"D1957+D1972+D1978","v":0},{"$f":"E1957+E1972+E1978","v":0},0,0,0,0,0,0,0,0,0,0,0]
[8100,"PARTICIPACIONES",null,{"$f":"SUM(D1958:D1971)","v":0},{"$f":"SUM(E1958:E1971)","v":0},0,0,0,0,0,0,0,0,0,0,0]
[811,"Fondo general de participaciones",{"$nulls":13},{"$f":"SUM(D1958:O1958)","v":0}]
[812,"Fondo de fomento municipal",{"$nulls":13},0]
[813,"Participaciones de las entidades federativas a los municipios",{"$nulls":13},0]
[814,"Otros conceptos participables de la Federación a entidades federativas",{"$nulls":13},0]
[815,"Otros conceptos participables de la Federación a municipios",{"$nulls":13},0]
[816,"Convenios de colaboración administrativa",11,{"$nulls":12},0]
[null,null,12,{"$nulls":12},0]
[null,null,14,{"$nulls":12},0]
[null,null,15,{"$nulls":12},0]
[null,null,16,{"$nulls":12},0]
[null,null,17,{"$nulls":12},0]
[null,null,25,{"$nulls":12},0]
[null,null,26,{"$nulls":12},0]
[null,null,27,{"$nulls":12},0]
[8300,"APORTACIONES",null,{"$f":"SUM(D1973:D1977)","v":0},{"$f":"SUM(E1973:E1977)","v":0},0,0,0,0,0,0,0,0,0,0,0]
[831,"Aportaciones de la Federación a las entidades federativas",{"$nulls":13},{"$f":"SUM(D1973:O1973)","v":0}]
[832,"Aportaciones de la Federación a municipios",{"$nulls":13},0]
[833,"Aportaciones de las entidades federativas a los municipios",{"$nulls":13},0]
[834,"Aportaciones  previstas en leyes y decretos al sistema de protección social",{"$nulls":13},0]
[835,"Aportaciones previstas en leyes y decretos compensatorias a entidades federativas y municipios",{"$nulls":13},0]
[8500,"CONVENIOS",null,{"$f":"SUM(D1979:D2005)","v":0},{"$f":"SUM(E1979:E2005)","v":0},0,0,0,0,0,0,0,0,0,0,0]
[851,"Convenios de reasignación",11,{"$nulls":12},{"$f":"SUM(D1979:O1979)","v":0}]
[null,null,12,{"$nulls":12},{"$f":"SUM(D1980:O1980)","v":0}]
[null,null,14,{"$nulls":12},0]
[null,null,15,{"$nulls":12},0]
[null,null,16,{"$nulls":12},0]
[null,null,17,{"$nulls":12},0]
[null,null,25,{"$nulls":12},0]
[null,null,26,{"$nulls":12},0]
[null,null,27,{"$nulls":12},0]
[852,"Convenios de descentralización",11,{"$nulls":12},0]
[null,null,12,{"$nulls":12},0]
[null,null,14,{"$nulls":12},0]
[null,null,15,{"$nulls":12},0]
[null,null,16,{"$nulls":12},0]
[null,null,17,{"$nulls":12},0]
[null,null,25,{"$nulls":12},0]
[null,null,26,{"$nulls":12},0]
[null,null,27,{"$nulls":12},0]
[853,"Otros convenios",11,{"$nulls":12},0]
[null,null,12,{"$nulls":12},0]
[null,null,14,{"$nulls":12},0]
[null,null,15,{"$nulls":12},0]
[null,null,16,{"$nulls":12},0]
[null,null,17,{"$nulls":12},0]
[null,null,25,{"$nulls":12},0]
[null,null,26,{"$nulls":12},0]
[null,null,27,{"$nulls":12},0]
[9000,"DEUDA  PÚBLICA",null,{"$f":"D2007+D2031+D2055+D2063+D2071+D2078+D2081","v":0},0,0,0,0,0,0,0,0,0,0,0,0]
[9100,"AMORTIZACIÓN DE LA DEUDA PÚBLICA ",null,{"$f":"SUM(D2008:D2030)","v":0},0,0,0,0,0,0,0,0,0,0,0,0]
[911,"Amortización de la deuda interna con instituciones de crédito",11,{"$nulls":12},{"$f":"SUM(D2008:O2008)","v":0}]
[null,null,14,{"$nulls":12},0]
[null,null,15,{"$nulls":12},0]
[null,null,16,{"$nulls":12},0]
[null,null,17,{"$nulls":12},0]
[null,null,25,{"$nulls":12},0]
[912,"Amortización  de la deuda interna por emisión de títulos y valores",11,{"$nulls":12},0]
[null,null,14,{"$nulls":12},0]
[null,null,15,{"$nulls":12},0]
[null,null,16,{"$nulls":12},0]
[null,null,17,{"$nulls":12},0]
[null,null,25,{"$nulls":12},0]
[913,"Amortización de arrendamientos financieros nacionales",11,{"$nulls":12},0]
[null,null,14,{"$nulls":12},0]
[null,null,15,{"$nulls":12},0]
[null,null,16,{"$nulls":12},0]
[null,null,17,{"$nulls":12},0]
[null,null,25,{"$nulls":12},0]
[914,"Amortización de la deuda externa con instituciones de crédito ",{"$nulls":13},0]
[915,"Amortización de deuda externa con organismos financieros internacionales",{"$nulls":13},0]
[916,"Amortización de la deuda bilateral",{"$nulls":13},0]
[917,"Amortización de la deuda externa por emisión de títulos y valores",{"$nulls":13},0]
[918,"Amortización de arrendamientos financieros internacionales",{"$nulls":13},0]
[9200,"INTERESES DE LA DEUDA PÚBLICA",null,{"$f":"SUM(D2032:D2054)","v":0},0,0,0,0,0,0,0,0,0,0,0,0]
[921,"Intereses de la deuda interna con instituciones de crédito",11,{"$nulls":12},{"$f":"SUM(D2032:O2032)","v":0}]
[null,null,14,{"$nulls":12},0]
[null,null,15,{"$nulls":12},0]
[null,null,16,{"$nulls":12},0]
[null,null,17,{"$nulls":12},0]
[null,null,25,{"$nulls":12},0]
[922,"Intereses derivados de la colocación de títulos y valores",11,{"$nulls":12},0]
[null,null,14,{"$nulls":12},0]
[null,null,15,{"$nulls":12},0]
[null,null,16,{"$nulls":12},0]
[null,null,17,{"$nulls":12},0]
[null,null,25,{"$nulls":12},0]
[923,"Intereses por arrendamientos  financieros nacionales",11,{"$nulls":12},0]
[null,null,14,{"$nulls":12},0]
[null,null,15,{"$nulls":12},0]
[null,null,16,{"$nulls":12},0]
[null,null,17,{"$nulls":12},0]
[null,null,25,{"$nulls":12},0]
[924,"Intereses de la deuda externa con instituciones de crédito ",{"$nulls":13},0]
[925,"Intereses de la deuda con organismos financieros internacionales",{"$nulls":13},0]
[926,"Intereses de la deuda bilateral  ",{"$nulls":13},0]
[927,"Intereses derivados de la colocación de títulos y valores en el exterior",{"$nulls":13},0]
[928,"Intereses por arrendamientos financieros internacionales",{"$nulls":13},0]
[9300,"COMISIONES DE LA DEUDA PÚBLICA",null,{"$f":"SUM(D2056:D2062)","v":0},0,0,0,0,0,0,0,0,0,0,0,0]
[931,"Comisiones de la deuda pública interna",11,{"$nulls":12},{"$f":"SUM(D2056:O2056)","v":0}]
[null,null,14,{"$nulls":12},{"$f":"SUM(D2057:O2057)","v":0}]
[null,null,15,{"$nulls":12},0]
[null,null,16,{"$nulls":12},0]
[null,null,17,{"$nulls":12},0]
[null,null,25,{"$nulls":12},0]
[932,"Comisiones de la deuda pública externa",{"$nulls":13},{"$f":"SUM(D2062:O2062)","v":0}]
[9400,"GASTOS DE LA DEUDA PÚBLICA",null,{"$f":"SUM(D2064:D2070)","v":0},0,0,0,0,0,0,0,0,0,0,0,0]
[941,"Gastos de la deuda pública interna",11,{"$nulls":12},{"$f":"SUM(D2064:O2064)","v":0}]
[null,null,14,{"$nulls":12},{"$f":"SUM(D2065:O2065)","v":0}]
[null,null,15,{"$nulls":12},0]
[null,null,16,{"$nulls":12},0]
[null,null,17,{"$nulls":12},0]
[null,null,25,{"$nulls":12},0]
[942,"Gastos de la deuda  pública externa",{"$nulls":13},{"$f":"SUM(D2070:O2070)","v":0}]
[9500,"COSTO POR COBERTURAS",null,{"$f":"SUM(D2072:D2077)","v":0},0,0,0,0,0,0,0,0,0,0,0,0]
[951,"Costos por coberturas",11,{"$nulls":12},{"$f":"SUM(D2072:O2072)","v":0}]
[null,null,14,{"$nulls":12},{"$f":"SUM(D2073:O2073)","v":0}]
[null,null,15,{"$nulls":12},0]
[null,null,16,{"$nulls":12},0]
[null,null,17,{"$nulls":12},0]
[null,null,25,{"$nulls":12},0]
[9600,"APOYOS FINANCIEROS",null,{"$f":"SUM(D2079:D2080)","v":0},{"$f":"SUM(E2079:E2080)","v":0},0,0,0,0,0,0,0,0,0,0,0]
[961,"Apoyos a intermediarios financieros",{"$nulls":13},{"$f":"SUM(D2079:O2079)","v":0}]
[962,"Apoyos a ahorradores y deudores del Sistema Financiero Nacional",{"$nulls":13},0]
[9900,"ADEUDOS DE EJERCICIOS FISCALES ANTERIORES (ADEFAS)",null,{"$f":"SUM(D2082:D2087)","v":0},0,0,0,0,0,0,0,0,0,0,0,0]
[991,"ADEFAS",11,{"$nulls":12},{"$f":"SUM(D2082:O2082)","v":0}]
[null,null,14,{"$nulls":12},{"$f":"SUM(D2083:O2083)","v":0}]
[null,null,15,{"$nulls":12},0]
[null,null,16,{"$nulls":12},0]
[null,null,17,{"$nulls":12},0]
[null,null,25,{"$nulls":12},0]
[null,"TOTAL DE EGRESOS",null,{"$f":"D2+D148+D443+D837+D1081+D1531+D1697+D1956+D2006","v":{"v":182769,"d":"182,769"}},{"v":182769,"d":"182,769"},{"v":194672,"d":"194,672"},{"v":182769,"d":"182,769"},{"v":182769,"d":"182,769"},{"v":182769,"d":"182,769"},{"v":182769,"d":"182,769"},{"v":182769,"d":"182,769"},{"v":182769,"d":"182,769"},{"v":182769,"d":"182,769"},{"v":182769,"d":"182,769"},{"v":182769,"d":"182,769"},{"v":2205131,"d":"2,205,131"}]

{"sheet":"BDI","index":4,"n_rows":2379,"n_cols":6,"rows_kept":2379,"hidden":true}
["No. ente",{"$f":"FU!K14","v":"SISTEMA PARA EL DESARROLLO INTEGRAL DE LA FAMILIA DEL MUNICIPIO DE SAN IGNACIO CERRO GORDO"}]
["región",{"$f":"FU!B12","v":0}]
["población",{"$f":"FU!C12","v":0}]
["año",{"$f":"FU!Q18","v":2020}]
[100000,"I",1000,{"v":0,"d":"00"},"IMPUESTOS",{"$f":"'CRI-M'!O2","v":0}]
[110000,"I",1100,{"v":0,"d":"00"},"Impuestos sobre los ingresos",{"$f":"'CRI-M'!O3","v":0}]
[110111,"I",1101,11,"Impuestos sobre espectáculos públicos",{"$f":"'CRI-M'!O4","v":0}]
[120000,"I",1200,{"v":0,"d":"00"},"Impuestos sobre el patrimonio",{"$f":"'CRI-M'!O5","v":0}]
[120111,"I",1201,11,"Impuesto predial",{"$f":"'CRI-M'!O6","v":0}]
[120211,"I",1202,11,"Impuestos sobre transmisiones patrimoniales",{"$f":"'CRI-M'!O7","v":0}]
[120311,"I",1203,11,"Impuestos sobre negocios jurídicos",{"$f":"'CRI-M'!O8","v":0}]
[130000,"I",1300,{"v":0,"d":"00"},"Impuestos sobre la producción, el consumo y las transacciones",{"$f":"'CRI-M'!O9","v":0}]
[140000,"I",1400,{"v":0,"d":"00"},"Impuestos al comercio exterior",{"$f":"'CRI-M'!O10","v":0}]
[150000,"I",1500,{"v":0,"d":"00"},"Impuestos sobre nóminas y asimilables",{"$f":"'CRI-M'!O11","v":0}]
[160000,"I",1600,{"v":0,"d":"00"},"Impuestos ecológicos",{"$f":"'CRI-M'!O12","v":0}]
[170000,"I",1700,{"v":0,"d":"00"},"Accesorios de impuestos",{"$f":"'CRI-M'!O13","v":0}]
[170111,"I",1701,11,"Recargos",{"$f":"'CRI-M'!O14","v":0}]
[170211,"I",1702,11,"Actualizaciones",{"$f":"'CRI-M'!O15","v":0}]
[170311,"I",1703,11,"Multas",{"$f":"'CRI-M'!O16","v":0}]
[170411,"I",1704,11,"Gastos de ejecución",{"$f":"'CRI-M'!O17","v":0}]
[170911,"I",1709,11,"Otros no especificados",{"$f":"'CRI-M'!O18","v":0}]
[180000,"I",1800,{"v":0,"d":"00"},"Otros impuestos",{"$f":"'CRI-M'!O19","v":0}]
[180111,"I",1801,11,"Otros impuestos",{"$f":"'CRI-M'!O20","v":0}]
[200000,"I",2000,{"v":0,"d":"00"},"CUOTAS Y APORTACIONES DE SEGURIDAD SOCIAL",{"$f":"'CRI-M'!O21","v":0}]
[210000,"I",2100,{"v":0,"d":"00"},"Aportaciones para fondos de vivienda",{"$f":"'CRI-M'!O22","v":0}]
[220000,"I",2200,{"v":0,"d":"00"},"Cuotas para la seguridad social",{"$f":"'CRI-M'!O23","v":0}]
[230000,"I",2300,{"v":0,"d":"00"},"Cuotas de ahorro para el retiro",{"$f":"'CRI-M'!O24","v":0}]
[240000,"I",2400,{"v":0,"d":"00"},"Otras cuotas y aportaciones para la seguridad social",{"$f":"'CRI-M'!O25","v":0}]
[250000,"I",2500,{"v":0,"d":"00"},"Accesorios de cuotas y aportaciones de seguridad social",{"$f":"'CRI-M'!O26","v":0}]
[300000,"I",3000,{"v":0,"d":"00"},"CONTRIBUCIONES DE MEJORAS",{"$f":"'CRI-M'!O27","v":0}]
[310000,"I",3100,{"v":0,"d":"00"},"Contribuciones de mejoras por obras públicas",{"$f":"'CRI-M'!O28","v":0}]
[310111,"I",3101,11,"Contribuciones de mejoras por obras públicas",{"$f":"'CRI-M'!O29","v":0}]
[400000,"I",4000,{"v":0,"d":"00"},"DERECHOS",{"$f":"'CRI-M'!O30","v":0}]
[410000,"I",4100,{"v":0,"d":"00"},"Derechos por el uso, goce, aprovechamiento o explotación de bienes de dominio público",{"$f":"'CRI-M'!O31","v":0}]
[410111,"I",4101,11,"Derechos por el uso del piso",{"$f":"'CRI-M'!O32","v":0}]
[410211,"I",4102,11,"Derechos por el uso de los estacionamientos",{"$f":"'CRI-M'!O33","v":0}]
[410311,"I",4103,11,"Derechos de uso de cementerios y panteones municipales",{"$f":"'CRI-M'!O34","v":0}]
[410411,"I",4104,11,"Derechos de concesiones y demás inmuebles de propiedad municipal",{"$f":"'CRI-M'!O35","v":0}]
[420000,"I",4200,{"v":0,"d":"00"},"Derechos a los hidrocarburos (Derogado)",{"$f":"'CRI-M'!O36","v":0}]
[430000,"I",4300,{"v":0,"d":"00"},"Derechos por prestación de servicios",{"$f":"'CRI-M'!O37","v":0}]
[430111,"I",4301,11,"Derechos de licencias y permisos de giros",{"$f":"'CRI-M'!O38","v":0}]
[430211,"I",4302,11,"Derechos de licencias y permisos de anuncios",{"$f":"'CRI-M'!O39","v":0}]
[430311,"I",4303,11,"Derechos de licencias de construcción, reconstrucción, reparación o demolición de obras",{"$f":"'CRI-M'!O40","v":0}]
[430411,"I",4304,11,"Derechos de regularizaciones de los registros de obra",{"$f":"'CRI-M'!O41","v":0}]
[430511,"I",4305,11,"Derechos de alineamiento, designación de número oficial e inspección",{"$f":"'CRI-M'!O42","v":0}]
[430611,"I",4306,11,"Derechos de licencias de cambio de régimen de propiedad y urbanización",{"$f":"'CRI-M'!O43","v":0}]
[430711,"I",4307,11,"Derechos de servicios de obra",{"$f":"'CRI-M'!O44","v":0}]
[430811,"I",4308,11,"Derechos de servicios de sanidad",{"$f":"'CRI-M'!O45","v":0}]
[430911,"I",4309,11,"Derechos de servicio de limpieza, recolección, traslado, tratamiento y disposición final de residuos",{"$f":"'CRI-M'!O46","v":0}]
[431011,"I",4310,11,"Derechos de agua potable, drenaje, alcantarillado, tratamiento y disposición final de aguas residuales",{"$f":"'CRI-M'!O47","v":0}]
[431111,"I",4311,11,"Derechos del rastro",{"$f":"'CRI-M'!O48","v":0}]
[431211,"I",4312,11,"Derechos del registro civil",{"$f":"'CRI-M'!O49","v":0}]
[431311,"I",4313,11,"Derechos de las certificaciones",{"$f":"'CRI-M'!O50","v":0}]
[431411,"I",4314,11,"Derechos de los servicios de catastro",{"$f":"'CRI-M'!O51","v":0}]
[440000,"I",4400,{"v":0,"d":"00"},"Otros derechos",{"$f":"'CRI-M'!O52","v":0}]
[440111,"I",4401,11,"Otros derechos",{"$f":"'CRI-M'!O53","v":0}]
[450000,"I",4500,{"v":0,"d":"00"},"Accesorios de derechos",{"$f":"'CRI-M'!O54","v":0}]
[450111,"I",4501,11,"Recargos",{"$f":"'CRI-M'!O55","v":0}]
[450211,"I",4502,11,"Actualizaciones",{"$f":"'CRI-M'!O56","v":0}]
[450311,"I",4503,11,"Multas",{"$f":"'CRI-M'!O57","v":0}]
[450411,"I",4504,11,"Gastos de ejecución",{"$f":"'CRI-M'!O58","v":0}]
[450911,"I",4509,11,"Otros no especificados",{"$f":"'CRI-M'!O59","v":0}]
[500000,"I",5000,{"v":0,"d":"00"},"PRODUCTOS",{"$f":"'CRI-M'!O60","v":{"v":130343,"d":"130,343"}}]
[510000,"I",5100,{"v":0,"d":"00"},"Productos",{"$f":"'CRI-M'!O61","v":{"v":130343,"d":"130,343"}}]
[510111,"I",5101,11,"Uso, goce, aprovechamiento o explotación de bienes de dominio privado",{"$f":"'CRI-M'!O62","v":0}]
[510211,"I",5102,11,"Productos diversos",{"$f":"'CRI-M'!O63","v":{"v":130343,"d":"130,343"}}]
[520000,"I",5200,{"v":0,"d":"00"},"Productos de capital (Derogado)",{"$f":"'CRI-M'!O64","v":0}]
[600000,"I",6000,{"v":0,"d":"00"},"APROVECHAMIENTOS",{"$f":"'CRI-M'!O65","v":0}]
[610000,"I",6100,{"v":0,"d":"00"},"Aprovechamientos",{"$f":"'CRI-M'!O66","v":0}]
[610111,"I",6101,11,"Aprovechamientos de las sanciones, multas, honorarios y donativos",{"$f":"'CRI-M'!O67","v":0}]
[610211,"I",6102,11,"Aprovechamientos de las indemnizaciones a favor del municipio",{"$f":"'CRI-M'!O68","v":0}]
[610311,"I",6103,11,"Otros aprovechamientos",{"$f":"'CRI-M'!O69","v":0}]
[620000,"I",6200,{"v":0,"d":"00"},"Aprovechamientos patrimoniales",{"$f":"'CRI-M'!O70","v":0}]
[620111,"I",6201,11,"Aprovechamientos por el uso o enajenación de bienes",{"$f":"'CRI-M'!O71","v":0}]
[620211,"I",6202,11,"Aprovechamientos por recuperación de capital o patrimonio invertido",{"$f":"'CRI-M'!O72","v":0}]
[630000,"I",6300,{"v":0,"d":"00"},"Accesorios de aprovechamientos",{"$f":"'CRI-M'!O73","v":0}]
[630111,"I",6301,11,"Recargos",{"$f":"'CRI-M'!O74","v":0}]
[630211,"I",6302,11,"Actualizaciones",{"$f":"'CRI-M'!O75","v":0}]
[630311,"I",6303,11,"Multas",{"$f":"'CRI-M'!O76","v":0}]
[630411,"I",6304,11,"Gastos de ejecución",{"$f":"'CRI-M'!O77","v":0}]
[630911,"I",6309,11,"Otros no especificados",{"$f":"'CRI-M'!O78","v":0}]
[700000,"I",7000,{"v":0,"d":"00"},"INGRESOS POR VENTAS DE BIENES, PRESTACIÓN DE SERVICIOS Y OTROS INGRESOS",{"$f":"'CRI-M'!O79","v":0}]
[710000,"I",7100,{"v":0,"d":"00"},"Ingresos por venta de bienes y prestación de servicios de instituciones públicas de seguridad social",{"$f":"'CRI-M'!O80","v":0}]
[710114,"I",7101,14,"Ingresos por venta de bienes y prestación de servicios de instituciones públicas de seguridad social",{"$f":"'CRI-M'!O81","v":0}]
[720000,"I",7200,{"v":0,"d":"00"},"Ingresos por venta de bienes y prestación de servicios de empresas productivas del estado",{"$f":"'CRI-M'!O82","v":0}]
[730000,"I",7300,{"v":0,"d":"00"},"Ingresos por venta de bienes y prestación de servicios de entidades paraestatales y fideicomisos no empresariales y no financieros",{"$f":"'CRI-M'!O83","v":0}]
[730114,"I",7301,14,"Ingresos por venta de bienes y prestación de servicios de entidades paraestatales y fideicomisos no empresariales y no financieros",{"$f":"'CRI-M'!O84","v":0}]
[740000,"I",7400,{"v":0,"d":"00"},"Ingresos por venta de bienes y prestación de servicios de entidades paraestatales empresariales no financieras con participación estatal mayoritaria",{"$f":"'CRI-M'!O85","v":0}]
[750000,"I",7500,{"v":0,"d":"00"},"Ingresos por venta de bienes y prestación de servicios de entidades paraestatales empresariales financieras monetarias con participación estatal mayoritaria",{"$f":"'CRI-M'!O86","v":0}]
[760000,"I",7600,{"v":0,"d":"00"},"Ingresos por venta de bienes y prestación de servicios de entidades paraestatales empresariales financieras no monetarias con participación estatal mayoritaria",{"$f":"'CRI-M'!O87","v":0}]
[770000,"I",7700,{"v":0,"d":"00"},"Ingresos por venta de bienes y prestación de servicios de fideicomisos financieros públicos con participación estatal mayoritaria",{"$f":"'CRI-M'!O88","v":0}]
[770114,"I",7701,14,"Ingresos por venta de bienes y prestación de servicios de fideicomisos financieros públicos con participación estatal mayoritaria",{"$f":"'CRI-M'!O89","v":0}]
[780000,"I",7800,{"v":0,"d":"00"},"Ingresos por venta de bienes y prestación de servicios de los poderes legislativo y judicial, y de los órganos autónomos",{"$f":"'CRI-M'!O90","v":0}]
[790000,"I",7900,{"v":0,"d":"00"},"Otros ingresos",{"$f":"'CRI-M'!O91","v":0}]
[790114,"I",7901,14,"Otros ingresos",{"$f":"'CRI-M'!O92","v":0}]
[800000,"I",8000,{"v":0,"d":"00"},"PARTICIPACIONES, APORTACIONES, CONVENIOS, INCENTIVOS DERIVADOS DE LA COLABORACIÓN FISCAL Y FONDOS DISTINTOS DE LAS APORTACIONES",{"$f":"'CRI-M'!O93","v":0}]
[810000,"I",8100,{"v":0,"d":"00"},"Participaciones",{"$f":"'CRI-M'!O94","v":0}]
[810115,"I",8101,15,"Fondo general de participaciones (federal)",{"$f":"'CRI-M'!O95","v":0}]
[810215,"I",8102,15,"Fondo de fomento municipal (federal)",{"$f":"'CRI-M'!O96","v":0}]
[810315,"I",8103,15,"Fondo de fiscalización y recaudación (federal)",{"$f":"'CRI-M'!O97","v":0}]
[810415,"I",8104,15,"Fondo de compensación (federal)",{"$f":"'CRI-M'!O98","v":0}]
[810515,"I",8105,15,"Fondo de extracción de hidrocarburos (federal)",{"$f":"'CRI-M'!O99","v":0}]
[810615,"I",8106,15,"Impuesto especial sobre producción y servicios (federal)",{"$f":"'CRI-M'!O100","v":0}]
[810715,"I",8107,15,"0.136% de la recaudación federal participable (federal)",{"$f":"'CRI-M'!O101","v":0}]
[810815,"I",8108,15,"3.17% sobre extracción de petróleo (federal)",{"$f":"'CRI-M'!O102","v":0}]
[810915,"I",8109,15,"Gasolinas y diésel (federal)",{"$f":"'CRI-M'!O103","v":0}]
[811015,"I",8110,15,"Fondo del impuesto sobre la renta (federal)",{"$f":"'CRI-M'!O104","v":0}]
[811115,"I",8111,15,"Fondo de estabilización de los ingresos de las entidades federativas (federal)",{"$f":"'CRI-M'!O105","v":0}]
[811216,"I",8112,16,"Participaciones del estado",{"$f":"'CRI-M'!O106","v":0}]
[820000,"I",8200,{"v":0,"d":"00"},"Aportaciones",{"$f":"'CRI-M'!O107","v":0}]
[820125,"I",8201,25,"Fondo de aportaciones para la infraestructura social municipal",{"$f":"'CRI-M'!O108","v":0}]
[820225,"I",8202,25,"Fondo de aportaciones para el fortalecimiento municipal",{"$f":"'CRI-M'!O109","v":0}]
[830000,"I",8300,{"v":0,"d":"00"},"Convenios",{"$f":"'CRI-M'!O110","v":0}]
[830125,"I",8301,25,"Convenios de protección social en salud",{"$f":"'CRI-M'!O111","v":0}]
[830225,"I",8302,25,"Convenios de descentralizados",{"$f":"'CRI-M'!O112","v":0}]
[830325,"I",8303,25,"Convenio de reasignación",{"$f":"'CRI-M'!O113","v":0}]
[830417,"I",8304,17,"Otros convenios y subsidios (Con ingresos de libre disposición)",{"$f":"'CRI-M'!O114","v":0}]
[830425,"I",8304,25,"Otros convenios y subsidios (Con ingresos etiquetados federales)",{"$f":"'CRI-M'!O115","v":0}]
[830426,"I",8304,26,"Otros convenios y subsidios (Con ingresos etiquetados estatales)",{"$f":"'CRI-M'!O116","v":0}]
[840000,"I",8400,{"v":0,"d":"00"},"Incentivos derivados de la colaboración fiscal",{"$f":"'CRI-M'!O117","v":0}]
[840117,"I",8401,17,"Tenencia o uso de vehículos",{"$f":"'CRI-M'!O118","v":0}]
[840217,"I",8402,17,"Fondo de compensación ISAN",{"$f":"'CRI-M'!O119","v":0}]
[840317,"I",8403,17,"Impuesto sobre automóviles nuevos",{"$f":"'CRI-M'!O120","v":0}]
[840417,"I",8404,17,"Fondo de compensación de repecos-intermedios",{"$f":"'CRI-M'!O121","v":0}]
[840517,"I",8405,17,"Otros incentivos económicos",{"$f":"'CRI-M'!O122","v":0}]
[850000,"I",8500,{"v":0,"d":"00"},"Fondos distintos de aportaciones",{"$f":"'CRI-M'!O123","v":0}]
[850127,"I",8501,27,"Fondo para entidades federativas y municipios productores de hidrocarburos",{"$f":"'CRI-M'!O124","v":0}]
[850227,"I",8502,27,"Fondo minero",{"$f":"'CRI-M'!O125","v":0}]
[900000,"I",9000,{"v":0,"d":"00"},"TRANSFERENCIAS, ASIGNACIONES, SUBSIDIOS Y SUBVENCIONES Y PENSIONES Y JUBILACIONES",{"$f":"'CRI-M'!O126","v":{"v":2074788,"d":"2,074,788"}}]
[910000,"I",9100,{"v":0,"d":"00"},"Transferencias y asignaciones",{"$f":"'CRI-M'!O127","v":0}]
[910111,"I",9101,11,"Transferencias y asignaciones (Con ingresos de libre disposición)",{"$f":"'CRI-M'!O128","v":0}]
[910127,"I",9101,27,"Transferencias y asignaciones (Con ingresos etiquetados)",{"$f":"'CRI-M'!O129","v":0}]
[920000,"I",9200,{"v":0,"d":"00"},"Transferencias al resto del sector público (derogado)",{"$f":"'CRI-M'!O130","v":0}]
[930000,"I",9300,{"v":0,"d":"00"},"Subsidios y subvenciones",{"$f":"'CRI-M'!O131","v":{"v":2074788,"d":"2,074,788"}}]
[930111,"I",9301,11,"Subsidios y subvenciones (Con ingresos de libre disposición)",{"$f":"'CRI-M'!O132","v":{"v":2074788,"d":"2,074,788"}}]
[930127,"I",9301,27,"Subsidios y subvenciones (Con ingresos etiquetados)",{"$f":"'CRI-M'!O133","v":0}]
[940000,"I",9400,{"v":0,"d":"00"},"Ayudas sociales (derogado)",{"$f":"'CRI-M'!O134","v":0}]
[950000,"I",9500,{"v":0,"d":"00"},"Pensiones y jubilaciones",{"$f":"'CRI-M'!O135","v":0}]
[950111,"I",9501,11,"Pensiones y jubilaciones",{"$f":"'CRI-M'!O136","v":0}]
[960000,"I",9600,{"v":0,"d":"00"},"Transferencias a fideicomisos, mandatos y análogos (derogado)",{"$f":"'CRI-M'!O137","v":0}]
[970000,"I",9700,{"v":0,"d":"00"},"Transferencias del fondo mexicano del petróleo para la estabilización y el desarrollo",{"$f":"'CRI-M'!O138","v":0}]
[970111,"I",9701,11,"Transferencias del fondo mexicano del petróleo para la estabilización y el desarrollo",{"$f":"'CRI-M'!O139","v":0}]
[{"v":0,"d":"000000"},"I",{"v":0,"d":"0000"},{"v":0,"d":"00"},"INGRESOS DERIVADOS DE FINANCIAMIENTO",{"$f":"'CRI-M'!O140","v":0}]
[{"v":10000,"d":"010000"},"I",{"v":100,"d":"0100"},{"v":0,"d":"00"},"Endeudamiento interno",{"$f":"'CRI-M'!O141","v":0}]
[{"v":20000,"d":"020000"},"I",{"v":200,"d":"0200"},{"v":0,"d":"00"},"Endeudamiento externo",{"$f":"'CRI-M'!O142","v":0}]
[{"v":30000,"d":"030000"},"I",{"v":300,"d":"0300"},{"v":0,"d":"00"},"Financiamiento interno",{"$f":"'CRI-M'!O143","v":0}]
[{"v":30112,"d":"030112"},"I",{"v":301,"d":"0301"},12,"Financiamiento interno",{"$f":"'CRI-M'!O144","v":0}]
[null,"I",null,null,"ESTIMACIÓN DE INGRESOS",{"$f":"'CRI-M'!O145","v":{"v":2205131,"d":"2,205,131"}}]
[100000,"E",1000,{"v":0,"d":"00"},"SERVICIOS PERSONALES",{"$f":"'COG-M'!P2","v":{"v":1490399,"d":"1,490,399"}}]
[110000,"E",1100,{"v":0,"d":"00"},"REMUNERACIONES AL PERSONAL DE CARÁCTER PERMANENTE",{"$f":"'COG-M'!P3","v":{"v":1180032,"d":"1,180,032"}}]
[111111,"E",111,11,"Dietas",{"$f":"'COG-M'!P4","v":0}]
[111115,"E",111,15,null,{"$f":"'COG-M'!P5","v":0}]
[111116,"E",111,16,null,{"$f":"'COG-M'!P6","v":0}]
[111117,"E",111,17,null,{"$f":"'COG-M'!P7","v":0}]
[111200,"E",112,{"v":0,"d":"00"},"Haberes",{"$f":"'COG-M'!P8","v":0}]
[111311,"E",113,11,"Sueldos base al personal permanente",{"$f":"'COG-M'!P9","v":{"v":1180032,"d":"1,180,032"}}]
[111314,"E",113,14,null,{"$f":"'COG-M'!P10","v":0}]
[111315,"E",113,15,null,{"$f":"'COG-M'!P11","v":0}]
[111316,"E",113,16,null,{"$f":"'COG-M'!P12","v":0}]
[111317,"E",113,17,null,{"$f":"'COG-M'!P13","v":0}]
[111325,"E",113,25,null,{"$f":"'COG-M'!P14","v":0}]
[111411,"E",114,11,"Remuneraciones por adscripción laboral en el extranjero",{"$f":"'COG-M'!P15","v":0}]
[111415,"E",114,15,null,{"$f":"'COG-M'!P16","v":0}]
[111416,"E",114,16,null,{"$f":"'COG-M'!P17","v":0}]
[111417,"E",114,17,null,{"$f":"'COG-M'!P18","v":0}]
[120000,"E",1200,{"v":0,"d":"00"},"REMUNERACIONES AL PERSONAL DE CARÁCTER TRANSITORIO",{"$f":"'COG-M'!P19","v":{"v":11903,"d":"11,903"}}]
[112111,"E",121,11,"Honorarios asimilables a salarios",{"$f":"'COG-M'!P20","v":0}]
[112114,"E",121,14,null,{"$f":"'COG-M'!P21","v":0}]
[112115,"E",121,15,null,{"$f":"'COG-M'!P22","v":0}]
[112116,"E",121,16,null,{"$f":"'COG-M'!P23","v":0}]
[112117,"E",121,17,null,{"$f":"'COG-M'!P24","v":0}]
[112211,"E",122,11,"Sueldos base al personal eventual",{"$f":"'COG-M'!P25","v":{"v":11903,"d":"11,903"}}]
[112214,"E",122,14,null,{"$f":"'COG-M'!P26","v":0}]
[112215,"E",122,15,null,{"$f":"'COG-M'!P27","v":0}]
[112216,"E",122,16,null,{"$f":"'COG-M'!P28","v":0}]
[112217,"E",122,17,null,{"$f":"'COG-M'!P29","v":0}]
[112225,"E",122,25,null,{"$f":"'COG-M'!P30","v":0}]
[112226,"E",122,26,null,{"$f":"'COG-M'!P31","v":0}]
[112227,"E",122,27,null,{"$f":"'COG-M'!P32","v":0}]
[112311,"E",123,11,"Retribuciones por servicios de carácter social",{"$f":"'COG-M'!P33","v":0}]
[112314,"E",123,14,null,{"$f":"'COG-M'!P34","v":0}]
[112315,"E",123,15,null,{"$f":"'COG-M'!P35","v":0}]
[112316,"E",123,16,null,{"$f":"'COG-M'!P36","v":0}]
[112317,"E",123,17,null,{"$f":"'COG-M'!P37","v":0}]
[112400,"E",124,{"v":0,"d":"00"},"Retribución a los representantes de los trabajadores y de los patrones en la Junta de Conciliación y Arbitraje",{"$f":"'COG-M'!P38","v":0}]
[130000,"E",1300,{"v":0,"d":"00"},"REMUNERACIONES ADICIONALES Y ESPECIALES",{"$f":"'COG-M'!P39","v":{"v":177912,"d":"177,912"}}]
[113111,"E",131,11,"Primas por años de servicios efectivos prestados",{"$f":"'COG-M'!P40","v":0}]
[113114,"E",131,14,null,{"$f":"'COG-M'!P41","v":0}]
[113115,"E",131,15,null,{"$f":"'COG-M'!P42","v":0}]
[113116,"E",131,16,null,{"$f":"'COG-M'!P43","v":0}]
[113117,"E",131,17,null,{"$f":"'COG-M'!P44","v":0}]
[113211,"E",132,11,"Primas de vacaciones, dominical y gratificación de fin de año",{"$f":"'COG-M'!P45","v":{"v":177912,"d":"177,912"}}]
[113214,"E",132,14,null,{"$f":"'COG-M'!P46","v":0}]
[113215,"E",132,15,null,{"$f":"'COG-M'!P47","v":0}]
[113216,"E",132,16,null,{"$f":"'COG-M'!P48","v":0}]
[113217,"E",132,17,null,{"$f":"'COG-M'!P49","v":0}]
[113225,"E",132,25,null,{"$f":"'COG-M'!P50","v":0}]
[113311,"E",133,11,"Horas extraordinarias",{"$f":"'COG-M'!P51","v":0}]
[113314,"E",133,14,null,{"$f":"'COG-M'!P52","v":0}]
[113315,"E",133,15,null,{"$f":"'COG-M'!P53","v":0}]
[113316,"E",133,16,null,{"$f":"'COG-M'!P54","v":0}]
[113317,"E",133,17,null,{"$f":"'COG-M'!P55","v":0}]
[113325,"E",133,25,null,{"$f":"'COG-M'!P56","v":0}]
[113411,"E",134,11,"Compensaciones",{"$f":"'COG-M'!P57","v":0}]
[113414,"E",134,14,null,{"$f":"'COG-M'!P58","v":0}]
[113415,"E",134,15,null,{"$f":"'COG-M'!P59","v":0}]
[113416,"E",134,16,null,{"$f":"'COG-M'!P60","v":0}]
[113417,"E",134,17,null,{"$f":"'COG-M'!P61","v":0}]
[113425,"E",134,25,null,{"$f":"'COG-M'!P62","v":0}]
[113500,"E",135,{"v":0,"d":"00"},"Sobrehaberes",{"$f":"'COG-M'!P63","v":0}]
[113600,"E",136,{"v":0,"d":"00"},"Asignaciones de técnico, de mando, por comisión, de vuelo y de técnico especial",{"$f":"'COG-M'!P64","v":0}]
[113711,"E",137,11,"Honorarios especiales",{"$f":"'COG-M'!P65","v":0}]
[113714,"E",137,14,null,{"$f":"'COG-M'!P66","v":0}]
[113715,"E",137,15,null,{"$f":"'COG-M'!P67","v":0}]
[113716,"E",137,16,null,{"$f":"'COG-M'!P68","v":0}]
[113717,"E",137,17,null,{"$f":"'COG-M'!P69","v":0}]
[113811,"E",138,11,"Participaciones por vigilancia en el cumplimiento de la leyes y custodia de valores",{"$f":"'COG-M'!P70","v":0}]
[113814,"E",138,14,null,{"$f":"'COG-M'!P71","v":0}]
[113815,"E",138,15,null,{"$f":"'COG-M'!P72","v":0}]
[113816,"E",138,16,null,{"$f":"'COG-M'!P73","v":0}]
[113817,"E",138,17,null,{"$f":"'COG-M'!P74","v":0}]
[140000,"E",1400,{"v":0,"d":"00"},"SEGURIDAD SOCIAL",{"$f":"'COG-M'!P75","v":{"v":87000,"d":"87,000"}}]
[114111,"E",141,11,"Aportaciones de seguridad social",{"$f":"'COG-M'!P76","v":{"v":87000,"d":"87,000"}}]
[114114,"E",141,14,null,{"$f":"'COG-M'!P77","v":0}]
[114115,"E",141,15,null,{"$f":"'COG-M'!P78","v":0}]
[114116,"E",141,16,null,{"$f":"'COG-M'!P79","v":0}]
[114117,"E",141,17,null,{"$f":"'COG-M'!P80","v":0}]
[114211,"E",142,11,"Aportaciones a fondos de vivienda",{"$f":"'COG-M'!P81","v":0}]
[114214,"E",142,14,null,{"$f":"'COG-M'!P82","v":0}]
[114215,"E",142,15,null,{"$f":"'COG-M'!P83","v":0}]
[114216,"E",142,16,null,{"$f":"'COG-M'!P84","v":0}]
[114217,"E",142,17,null,{"$f":"'COG-M'!P85","v":0}]
[114311,"E",143,11,"Aportaciones al sistema para el retiro",{"$f":"'COG-M'!P86","v":0}]
[114314,"E",143,14,null,{"$f":"'COG-M'!P87","v":0}]
[114315,"E",143,15,null,{"$f":"'COG-M'!P88","v":0}]
[114316,"E",143,16,null,{"$f":"'COG-M'!P89","v":0}]
[114317,"E",143,17,null,{"$f":"'COG-M'!P90","v":0}]
[114411,"E",144,11,"Aportaciones para seguros",{"$f":"'COG-M'!P91","v":0}]
[114414,"E",144,14,null,{"$f":"'COG-M'!P92","v":0}]
[114415,"E",144,15,null,{"$f":"'COG-M'!P93","v":0}]
[114416,"E",144,16,null,{"$f":"'COG-M'!P94","v":0}]
[114417,"E",144,17,null,{"$f":"'COG-M'!P95","v":0}]
[150000,"E",1500,{"v":0,"d":"00"},"OTRAS PRESTACIONES SOCIALES Y ECONÓMICAS",{"$f":"'COG-M'!P96","v":0}]
[115111,"E",151,11,"Cuotas para el fondo de ahorro y fondo de trabajo",{"$f":"'COG-M'!P97","v":0}]
[115114,"E",151,14,null,{"$f":"'COG-M'!P98","v":0}]
[115115,"E",151,15,null,{"$f":"'COG-M'!P99","v":0}]
[115116,"E",151,16,null,{"$f":"'COG-M'!P100","v":0}]
[115117,"E",151,17,null,{"$f":"'COG-M'!P101","v":0}]
[115125,"E",151,25,null,{"$f":"'COG-M'!P102","v":0}]
[115211,"E",152,11,"Indemnizaciones",{"$f":"'COG-M'!P103","v":0}]
[115214,"E",152,14,null,{"$f":"'COG-M'!P104","v":0}]
[115215,"E",152,15,null,{"$f":"'COG-M'!P105","v":0}]
[115216,"E",152,16,null,{"$f":"'COG-M'!P106","v":0}]
[115217,"E",152,17,null,{"$f":"'COG-M'!P107","v":0}]
[115227,"E",152,27,null,{"$f":"'COG-M'!P108","v":0}]
[115311,"E",153,11,"Prestaciones y haberes de retiro",{"$f":"'COG-M'!P109","v":0}]
[115314,"E",153,14,null,{"$f":"'COG-M'!P110","v":0}]
[115315,"E",153,15,null,{"$f":"'COG-M'!P111","v":0}]
[115316,"E",153,16,null,{"$f":"'COG-M'!P112","v":0}]
[115317,"E",153,17,null,{"$f":"'COG-M'!P113","v":0}]
[115411,"E",154,11,"Prestaciones contractuales",{"$f":"'COG-M'!P114","v":0}]
[115414,"E",154,14,null,{"$f":"'COG-M'!P115","v":0}]
[115415,"E",154,15,null,{"$f":"'COG-M'!P116","v":0}]
[115416,"E",154,16,null,{"$f":"'COG-M'!P117","v":0}]
[115417,"E",154,17,null,{"$f":"'COG-M'!P118","v":0}]
[115425,"E",154,25,null,{"$f":"'COG-M'!P119","v":0}]
[115511,"E",155,11,"Apoyos a la capacitación de los servidores públicos",{"$f":"'COG-M'!P120","v":0}]
[115514,"E",155,14,null,{"$f":"'COG-M'!P121","v":0}]
[115515,"E",155,15,null,{"$f":"'COG-M'!P122","v":0}]
[115516,"E",155,16,null,{"$f":"'COG-M'!P123","v":0}]
[115517,"E",155,17,null,{"$f":"'COG-M'!P124","v":0}]
[115911,"E",159,11,"Otras prestaciones sociales y económicas",{"$f":"'COG-M'!P125","v":0}]
[115914,"E",159,14,null,{"$f":"'COG-M'!P126","v":0}]
[115915,"E",159,15,null,{"$f":"'COG-M'!P127","v":0}]
[115916,"E",159,16,null,{"$f":"'COG-M'!P128","v":0}]
[115917,"E",159,17,null,{"$f":"'COG-M'!P129","v":0}]
[160000,"E",1600,{"v":0,"d":"00"},"PREVISIONES",{"$f":"'COG-M'!P130","v":{"v":33552,"d":"33,552"}}]
[116111,"E",161,11,"Previsiones de carácter laboral, económica y de seguridad social",{"$f":"'COG-M'!P131","v":{"v":33552,"d":"33,552"}}]
[116114,"E",161,14,null,{"$f":"'COG-M'!P132","v":0}]
[116115,"E",161,15,null,{"$f":"'COG-M'!P133","v":0}]
[116116,"E",161,16,null,{"$f":"'COG-M'!P134","v":0}]
[116117,"E",161,17,null,{"$f":"'COG-M'!P135","v":0}]
[116125,"E",161,25,null,{"$f":"'COG-M'!P136","v":0}]
[170000,"E",1700,{"v":0,"d":"00"},"PAGO DE ESTÍMULOS A SERVIDORES PÚBLICOS",{"$f":"'COG-M'!P137","v":0}]
[117111,"E",171,11,"Estímulos",{"$f":"'COG-M'!P138","v":0}]
[117114,"E",171,14,null,{"$f":"'COG-M'!P139","v":0}]
[117115,"E",171,15,null,{"$f":"'COG-M'!P140","v":0}]
[117116,"E",171,16,null,{"$f":"'COG-M'!P141","v":0}]
[117117,"E",171,17,null,{"$f":"'COG-M'!P142","v":0}]
[117211,"E",172,11,"Recompensas",{"$f":"'COG-M'!P143","v":0}]
[117214,"E",172,14,null,{"$f":"'COG-M'!P144","v":0}]
[117215,"E",172,15,null,{"$f":"'COG-M'!P145","v":0}]
[117216,"E",172,16,null,{"$f":"'COG-M'!P146","v":0}]
[117217,"E",172,17,null,{"$f":"'COG-M'!P147","v":0}]
[200000,"E",2000,{"v":0,"d":"00"},"MATERIALES Y SUMINISTROS",{"$f":"'COG-M'!P148","v":{"v":370128,"d":"370,128"}}]
[210000,"E",2100,{"v":0,"d":"00"},"MATERIALES DE ADMINISTRACIÓN, EMISIÓN DE DOCUMENTOS Y ARTÍCULOS OFICIALES",{"$f":"'COG-M'!P149","v":{"v":42840,"d":"42,840"}}]
[221111,"E",211,11,"Materiales, útiles y equipos menores de oficina",{"$f":"'COG-M'!P150","v":{"v":28560,"d":"28,560"}}]
[221114,"E",211,14,null,{"$f":"'COG-M'!P151","v":0}]
[221115,"E",211,15,null,{"$f":"'COG-M'!P152","v":0}]
[221116,"E",211,16,null,{"$f":"'COG-M'!P153","v":0}]
[221117,"E",211,17,null,{"$f":"'COG-M'!P154","v":0}]
[221211,"E",212,11,"Materiales y útiles de impresión y reproducción",{"$f":"'COG-M'!P155","v":{"v":7140,"d":"7,140"}}]
[221214,"E",212,14,null,{"$f":"'COG-M'!P156","v":0}]
[221215,"E",212,15,null,{"$f":"'COG-M'!P157","v":0}]
[221216,"E",212,16,null,{"$f":"'COG-M'!P158","v":0}]
[221217,"E",212,17,null,{"$f":"'COG-M'!P159","v":0}]
[221311,"E",213,11,"Material estadístico y geográfico",{"$f":"'COG-M'!P160","v":0}]
[221314,"E",213,14,null,{"$f":"'COG-M'!P161","v":0}]
[221315,"E",213,15,null,{"$f":"'COG-M'!P162","v":0}]
[221316,"E",213,16,null,{"$f":"'COG-M'!P163","v":0}]
[221317,"E",213,17,null,{"$f":"'COG-M'!P164","v":0}]
[221411,"E",214,11,"Materiales, útiles y equipos menores de tecnologías de la información y comunicaciones",{"$f":"'COG-M'!P165","v":0}]
[221414,"E",214,14,null,{"$f":"'COG-M'!P166","v":0}]
[221415,"E",214,15,null,{"$f":"'COG-M'!P167","v":0}]
[221416,"E",214,16,null,{"$f":"'COG-M'!P168","v":0}]
[221417,"E",214,17,null,{"$f":"'COG-M'!P169","v":0}]
[221511,"E",215,11,"Material impreso e información digital",{"$f":"'COG-M'!P170","v":0}]
[221514,"E",215,14,null,{"$f":"'COG-M'!P171","v":0}]
[221515,"E",215,15,null,{"$f":"'COG-M'!P172","v":0}]
[221516,"E",215,16,null,{"$f":"'COG-M'!P173","v":0}]
[221517,"E",215,17,null,{"$f":"'COG-M'!P174","v":0}]
[221611,"E",216,11,"Material de limpieza",{"$f":"'COG-M'!P175","v":{"v":7140,"d":"7,140"}}]
[221614,"E",216,14,null,{"$f":"'COG-M'!P176","v":0}]
[221615,"E",216,15,null,{"$f":"'COG-M'!P177","v":0}]
[221616,"E",216,16,null,{"$f":"'COG-M'!P178","v":0}]
[221617,"E",216,17,null,{"$f":"'COG-M'!P179","v":0}]
[221711,"E",217,11,"Materiales y útiles de enseñanza",{"$f":"'COG-M'!P180","v":0}]
[221714,"E",217,14,null,{"$f":"'COG-M'!P181","v":0}]
[221715,"E",217,15,null,{"$f":"'COG-M'!P182","v":0}]
[221716,"E",217,16,null,{"$f":"'COG-M'!P183","v":0}]
[221717,"E",217,17,null,{"$f":"'COG-M'!P184","v":0}]
[221811,"E",218,11,"Materiales para el registro e identificación de bienes y personas",{"$f":"'COG-M'!P185","v":0}]
[221814,"E",218,14,null,{"$f":"'COG-M'!P186","v":0}]
[221815,"E",218,15,null,{"$f":"'COG-M'!P187","v":0}]
[221816,"E",218,16,null,{"$f":"'COG-M'!P188","v":0}]
[221817,"E",218,17,null,{"$f":"'COG-M'!P189","v":0}]
[220000,"E",2200,{"v":0,"d":"00"},"ALIMENTOS Y UTENSILIOS",{"$f":"'COG-M'!P190","v":{"v":139392,"d":"139,392"}}]
[222111,"E",221,11,"Productos alimenticios para personas",{"$f":"'COG-M'!P191","v":{"v":132252,"d":"132,252"}}]
[222114,"E",221,14,null,{"$f":"'COG-M'!P192","v":0}]
[222115,"E",221,15,null,{"$f":"'COG-M'!P193","v":0}]
[222116,"E",221,16,null,{"$f":"'COG-M'!P194","v":0}]
[222117,"E",221,17,null,{"$f":"'COG-M'!P195","v":0}]
[222125,"E",221,25,null,{"$f":"'COG-M'!P196","v":0}]
[222211,"E",222,11,"Productos alimenticios para animales",{"$f":"'COG-M'!P197","v":0}]
[222214,"E",222,14,null,{"$f":"'COG-M'!P198","v":0}]
[222215,"E",222,15,null,{"$f":"'COG-M'!P199","v":0}]
[222216,"E",222,16,null,{"$f":"'COG-M'!P200","v":0}]
[222217,"E",222,17,null,{"$f":"'COG-M'!P201","v":0}]
[222311,"E",223,11,"Utensilios para el servicio de alimentación",{"$f":"'COG-M'!P202","v":{"v":7140,"d":"7,140"}}]
[222314,"E",223,14,null,{"$f":"'COG-M'!P203","v":0}]
[222315,"E",223,15,null,{"$f":"'COG-M'!P204","v":0}]
[222316,"E",223,16,null,{"$f":"'COG-M'!P205","v":0}]
[222317,"E",223,17,null,{"$f":"'COG-M'!P206","v":0}]
[230000,"E",2300,{"v":0,"d":"00"},"MATERIAS PRIMAS Y MATERIALES DE PRODUCCIÓN Y COMERCIALIZACIÓN",{"$f":"'COG-M'!P207","v":0}]
[223100,"E",231,{"v":0,"d":"00"},"Productos alimenticios, agropecuarios y forestales adquiridos como materia prima",{"$f":"'COG-M'!P208","v":0}]
[223200,"E",232,{"v":0,"d":"00"},"Insumos textiles adquiridos como materia prima",{"$f":"'COG-M'!P209","v":0}]
[223300,"E",233,{"v":0,"d":"00"},"Productos de papel, cartón e impresos adquiridos como materia prima",{"$f":"'COG-M'!P210","v":0}]
[223400,"E",234,{"v":0,"d":"00"},"Combustibles, lubricantes, aditivos, carbón y sus derivados adquiridos como materia prima",{"$f":"'COG-M'!P211","v":0}]
[223500,"E",235,{"v":0,"d":"00"},"Productos químicos, farmacéuticos y de laboratorio adquiridos como materia prima",{"$f":"'COG-M'!P212","v":0}]
[223600,"E",236,{"v":0,"d":"00"},"Productos metálicos y a base de minerales no metálicos adquiridos como materia prima",{"$f":"'COG-M'!P213","v":0}]
[223700,"E",237,{"v":0,"d":"00"},"Productos de cuero, piel, plástico y hule adquiridos como materia prima",{"$f":"'COG-M'!P214","v":0}]
[223800,"E",238,{"v":0,"d":"00"},"Mercancías adquiridas para su comercialización",{"$f":"'COG-M'!P215","v":0}]
[223900,"E",239,{"v":0,"d":"00"},"Otros productos adquiridos como materia prima",{"$f":"'COG-M'!P216","v":0}]
[240000,"E",2400,{"v":0,"d":"00"},"MATERIALES Y ARTÍCULOS DE CONSTRUCCIÓN Y DE REPARACIÓN",{"$f":"'COG-M'!P217","v":0}]
[224111,"E",241,11,"Productos minerales no metálicos",{"$f":"'COG-M'!P218","v":0}]
[224114,"E",241,14,null,{"$f":"'COG-M'!P219","v":0}]
[224115,"E",241,15,null,{"$f":"'COG-M'!P220","v":0}]
[224116,"E",241,16,null,{"$f":"'COG-M'!P221","v":0}]
[224117,"E",241,17,null,{"$f":"'COG-M'!P222","v":0}]
[224125,"E",241,25,null,{"$f":"'COG-M'!P223","v":0}]
[224126,"E",241,26,null,{"$f":"'COG-M'!P224","v":0}]
[224127,"E",241,27,null,{"$f":"'COG-M'!P225","v":0}]
[224211,"E",242,11,"Cemento y productos de concreto",{"$f":"'COG-M'!P226","v":0}]
[224214,"E",242,14,null,{"$f":"'COG-M'!P227","v":0}]
[224215,"E",242,15,null,{"$f":"'COG-M'!P228","v":0}]
[224216,"E",242,16,null,{"$f":"'COG-M'!P229","v":0}]
[224217,"E",242,17,null,{"$f":"'COG-M'!P230","v":0}]
[224225,"E",242,25,null,{"$f":"'COG-M'!P231","v":0}]
[224226,"E",242,26,null,{"$f":"'COG-M'!P232","v":0}]
[224227,"E",242,27,null,{"$f":"'COG-M'!P233","v":0}]
[224311,"E",243,11,"Cal, yeso y productos de yeso",{"$f":"'COG-M'!P234","v":0}]
[224314,"E",243,14,null,{"$f":"'COG-M'!P235","v":0}]
[224315,"E",243,15,null,{"$f":"'COG-M'!P236","v":0}]
[224316,"E",243,16,null,{"$f":"'COG-M'!P237","v":0}]
[224317,"E",243,17,null,{"$f":"'COG-M'!P238","v":0}]
[224325,"E",243,25,null,{"$f":"'COG-M'!P239","v":0}]
[224326,"E",243,26,null,{"$f":"'COG-M'!P240","v":0}]
[224327,"E",243,27,null,{"$f":"'COG-M'!P241","v":0}]
[224411,"E",244,11,"Madera y productos de madera",{"$f":"'COG-M'!P242","v":0}]
[224414,"E",244,14,null,{"$f":"'COG-M'!P243","v":0}]
[224415,"E",244,15,null,{"$f":"'COG-M'!P244","v":0}]
[224416,"E",244,16,null,{"$f":"'COG-M'!P245","v":0}]
[224417,"E",244,17,null,{"$f":"'COG-M'!P246","v":0}]
[224425,"E",244,25,null,{"$f":"'COG-M'!P247","v":0}]
[224426,"E",244,26,null,{"$f":"'COG-M'!P248","v":0}]
[224427,"E",244,27,null,{"$f":"'COG-M'!P249","v":0}]
[224511,"E",245,11,"Vidrio y productos de vidrio",{"$f":"'COG-M'!P250","v":0}]
[224514,"E",245,14,null,{"$f":"'COG-M'!P251","v":0}]
[224515,"E",245,15,null,{"$f":"'COG-M'!P252","v":0}]
[224516,"E",245,16,null,{"$f":"'COG-M'!P253","v":0}]
[224517,"E",245,17,null,{"$f":"'COG-M'!P254","v":0}]
[224525,"E",245,25,null,{"$f":"'COG-M'!P255","v":0}]
[224526,"E",245,26,null,{"$f":"'COG-M'!P256","v":0}]
[224527,"E",245,27,null,{"$f":"'COG-M'!P257","v":0}]
[224611,"E",246,11,"Material eléctrico y electrónico",{"$f":"'COG-M'!P258","v":0}]
[224614,"E",246,14,null,{"$f":"'COG-M'!P259","v":0}]
[224615,"E",246,15,null,{"$f":"'COG-M'!P260","v":0}]
[224616,"E",246,16,null,{"$f":"'COG-M'!P261","v":0}]
[224617,"E",246,17,null,{"$f":"'COG-M'!P262","v":0}]
[224625,"E",246,25,null,{"$f":"'COG-M'!P263","v":0}]
[224626,"E",246,26,null,{"$f":"'COG-M'!P264","v":0}]
[224627,"E",246,27,null,{"$f":"'COG-M'!P265","v":0}]
[224711,"E",247,11,"Artículos metálicos para la construcción",{"$f":"'COG-M'!P266","v":0}]
[224714,"E",247,14,null,{"$f":"'COG-M'!P267","v":0}]
[224715,"E",247,15,null,{"$f":"'COG-M'!P268","v":0}]
[224716,"E",247,16,null,{"$f":"'COG-M'!P269","v":0}]
[224717,"E",247,17,null,{"$f":"'COG-M'!P270","v":0}]
[224725,"E",247,25,null,{"$f":"'COG-M'!P271","v":0}]
[224726,"E",247,26,null,{"$f":"'COG-M'!P272","v":0}]
[224727,"E",247,27,null,{"$f":"'COG-M'!P273","v":0}]
[224811,"E",248,11,"Materiales complementarios",{"$f":"'COG-M'!P274","v":0}]
[224814,"E",248,14,null,{"$f":"'COG-M'!P275","v":0}]
[224815,"E",248,15,null,{"$f":"'COG-M'!P276","v":0}]
[224816,"E",248,16,null,{"$f":"'COG-M'!P277","v":0}]
[224817,"E",248,17,null,{"$f":"'COG-M'!P278","v":0}]
[224825,"E",248,25,null,{"$f":"'COG-M'!P279","v":0}]
[224826,"E",248,26,null,{"$f":"'COG-M'!P280","v":0}]
[224827,"E",248,27,null,{"$f":"'COG-M'!P281","v":0}]
[224911,"E",249,11,"Otros materiales y artículos de construcción y reparación",{"$f":"'COG-M'!P282","v":0}]
[224914,"E",249,14,null,{"$f":"'COG-M'!P283","v":0}]
[224915,"E",249,15,null,{"$f":"'COG-M'!P284","v":0}]
[224916,"E",249,16,null,{"$f":"'COG-M'!P285","v":0}]
[224917,"E",249,17,null,{"$f":"'COG-M'!P286","v":0}]
[224925,"E",249,25,null,{"$f":"'COG-M'!P287","v":0}]
[224926,"E",249,26,null,{"$f":"'COG-M'!P288","v":0}]
[224927,"E",249,27,null,{"$f":"'COG-M'!P289","v":0}]
[250000,"E",2500,{"v":0,"d":"00"},"PRODUCTOS QUÍMICOS, FARMACÉUTICOS Y DE LABORATORIO",{"$f":"'COG-M'!P290","v":0}]
[225111,"E",251,11,"Productos químicos básicos",{"$f":"'COG-M'!P291","v":0}]
[225114,"E",251,14,null,{"$f":"'COG-M'!P292","v":0}]
[225115,"E",251,15,null,{"$f":"'COG-M'!P293","v":0}]
[225116,"E",251,16,null,{"$f":"'COG-M'!P294","v":0}]
[225117,"E",251,17,null,{"$f":"'COG-M'!P295","v":0}]
[225211,"E",252,11,"Fertilizantes, pesticidas y otros agroquímicos",{"$f":"'COG-M'!P296","v":0}]
[225214,"E",252,14,null,{"$f":"'COG-M'!P297","v":0}]
[225215,"E",252,15,null,{"$f":"'COG-M'!P298","v":0}]
[225216,"E",252,16,null,{"$f":"'COG-M'!P299","v":0}]
[225217,"E",252,17,null,{"$f":"'COG-M'!P300","v":0}]
[225311,"E",253,11,"Medicinas y productos farmacéuticos",{"$f":"'COG-M'!P301","v":0}]
[225314,"E",253,14,null,{"$f":"'COG-M'!P302","v":0}]
[225315,"E",253,15,null,{"$f":"'COG-M'!P303","v":0}]
[225316,"E",253,16,null,{"$f":"'COG-M'!P304","v":0}]
[225317,"E",253,17,null,{"$f":"'COG-M'!P305","v":0}]
[225325,"E",253,25,null,{"$f":"'COG-M'!P306","v":0}]
[225326,"E",253,26,null,{"$f":"'COG-M'!P307","v":0}]
[225327,"E",253,27,null,{"$f":"'COG-M'!P308","v":0}]
[225411,"E",254,11,"Materiales, accesorios y suministros médicos",{"$f":"'COG-M'!P309","v":0}]
[225414,"E",254,14,null,{"$f":"'COG-M'!P310","v":0}]
[225415,"E",254,15,null,{"$f":"'COG-M'!P311","v":0}]
[225416,"E",254,16,null,{"$f":"'COG-M'!P312","v":0}]
[225417,"E",254,17,null,{"$f":"'COG-M'!P313","v":0}]
[225511,"E",255,11,"Materiales, accesorios y suministros de laboratorio",{"$f":"'COG-M'!P314","v":0}]
[225514,"E",255,14,null,{"$f":"'COG-M'!P315","v":0}]
[225515,"E",255,15,null,{"$f":"'COG-M'!P316","v":0}]
[225516,"E",255,16,null,{"$f":"'COG-M'!P317","v":0}]
[225517,"E",255,17,null,{"$f":"'COG-M'!P318","v":0}]
[225525,"E",255,25,null,{"$f":"'COG-M'!P319","v":0}]
[225526,"E",255,26,null,{"$f":"'COG-M'!P320","v":0}]
[225527,"E",255,27,null,{"$f":"'COG-M'!P321","v":0}]
[225611,"E",256,11,"Fibras sintéticas, hules plásticos y derivados",{"$f":"'COG-M'!P322","v":0}]
[225614,"E",256,14,null,{"$f":"'COG-M'!P323","v":0}]
[225615,"E",256,15,null,{"$f":"'COG-M'!P324","v":0}]
[225616,"E",256,16,null,{"$f":"'COG-M'!P325","v":0}]
[225617,"E",256,17,null,{"$f":"'COG-M'!P326","v":0}]
[225911,"E",259,11,"Otros productos químicos",{"$f":"'COG-M'!P327","v":0}]
[225914,"E",259,14,null,{"$f":"'COG-M'!P328","v":0}]
[225915,"E",259,15,null,{"$f":"'COG-M'!P329","v":0}]
[225916,"E",259,16,null,{"$f":"'COG-M'!P330","v":0}]
[225917,"E",259,17,null,{"$f":"'COG-M'!P331","v":0}]
[260000,"E",2600,{"v":0,"d":"00"},"COMBUSTIBLES, LUBRICANTES Y ADITIVOS",{"$f":"'COG-M'!P332","v":{"v":159672,"d":"159,672"}}]
[226111,"E",261,11,"Combustibles, lubricantes y aditivos",{"$f":"'COG-M'!P333","v":{"v":159672,"d":"159,672"}}]
[226114,"E",261,14,null,{"$f":"'COG-M'!P334","v":0}]
[226115,"E",261,15,null,{"$f":"'COG-M'!P335","v":0}]
[226116,"E",261,16,null,{"$f":"'COG-M'!P336","v":0}]
[226117,"E",261,17,null,{"$f":"'COG-M'!P337","v":0}]
[226125,"E",261,25,null,{"$f":"'COG-M'!P338","v":0}]
[226211,"E",262,11,"Carbón y sus derivados",{"$f":"'COG-M'!P339","v":0}]
[226214,"E",262,14,null,{"$f":"'COG-M'!P340","v":0}]
[226215,"E",262,15,null,{"$f":"'COG-M'!P341","v":0}]
[226216,"E",262,16,null,{"$f":"'COG-M'!P342","v":0}]
[226217,"E",262,17,null,{"$f":"'COG-M'!P343","v":0}]
[270000,"E",2700,{"v":0,"d":"00"},"VESTUARIO, BLANCOS, PRENDAS DE PROTECCIÓN Y ARTÍCULOS DEPORTIVOS",{"$f":"'COG-M'!P344","v":{"v":14268,"d":"14,268"}}]
[227111,"E",271,11,"Vestuario y uniformes",{"$f":"'COG-M'!P345","v":{"v":14268,"d":"14,268"}}]
[227114,"E",271,14,null,{"$f":"'COG-M'!P346","v":0}]
[227115,"E",271,15,null,{"$f":"'COG-M'!P347","v":0}]
[227116,"E",271,16,null,{"$f":"'COG-M'!P348","v":0}]
[227117,"E",271,17,null,{"$f":"'COG-M'!P349","v":0}]
[227211,"E",272,11,"Prendas de seguridad y protección personal",{"$f":"'COG-M'!P350","v":0}]
[227214,"E",272,14,null,{"$f":"'COG-M'!P351","v":0}]
[227215,"E",272,15,null,{"$f":"'COG-M'!P352","v":0}]
[227216,"E",272,16,null,{"$f":"'COG-M'!P353","v":0}]
[227217,"E",272,17,null,{"$f":"'COG-M'!P354","v":0}]
[227225,"E",272,25,null,{"$f":"'COG-M'!P355","v":0}]
[227226,"E",272,26,null,{"$f":"'COG-M'!P356","v":0}]
[227227,"E",272,27,null,{"$f":"'COG-M'!P357","v":0}]
[227311,"E",273,11,"Artículos deportivos",{"$f":"'COG-M'!P358","v":0}]
[227314,"E",273,14,null,{"$f":"'COG-M'!P359","v":0}]
[227315,"E",273,15,null,{"$f":"'COG-M'!P360","v":0}]
[227316,"E",273,16,null,{"$f":"'COG-M'!P361","v":0}]
[227317,"E",273,17,null,{"$f":"'COG-M'!P362","v":0}]
[227411,"E",274,11,"Productos textiles",{"$f":"'COG-M'!P363","v":0}]
[227414,"E",274,14,null,{"$f":"'COG-M'!P364","v":0}]
[227415,"E",274,15,null,{"$f":"'COG-M'!P365","v":0}]
[227416,"E",274,16,null,{"$f":"'COG-M'!P366","v":0}]
[227417,"E",274,17,null,{"$f":"'COG-M'!P367","v":0}]
[227511,"E",275,11,"Blancos y otros productos textiles, excepto prendas de vestir",{"$f":"'COG-M'!P368","v":0}]
[227514,"E",275,14,null,{"$f":"'COG-M'!P369","v":0}]
[227515,"E",275,15,null,{"$f":"'COG-M'!P370","v":0}]
[227516,"E",275,16,null,{"$f":"'COG-M'!P371","v":0}]
[227517,"E",275,17,null,{"$f":"'COG-M'!P372","v":0}]
[280000,"E",2800,{"v":0,"d":"00"},"MATERIALES Y SUMINISTROS PARA SEGURIDAD",{"$f":"'COG-M'!P373","v":0}]
[228111,"E",281,11,"Sustancias y materiales explosivos",{"$f":"'COG-M'!P374","v":0}]
[228114,"E",281,14,null,{"$f":"'COG-M'!P375","v":0}]
[228115,"E",281,15,null,{"$f":"'COG-M'!P376","v":0}]
[228116,"E",281,16,null,{"$f":"'COG-M'!P377","v":0}]
[228117,"E",281,17,null,{"$f":"'COG-M'!P378","v":0}]
[228211,"E",282,11,"Materiales de seguridad pública",{"$f":"'COG-M'!P379","v":0}]
[228214,"E",282,14,null,{"$f":"'COG-M'!P380","v":0}]
[228215,"E",282,15,null,{"$f":"'COG-M'!P381","v":0}]
[228216,"E",282,16,null,{"$f":"'COG-M'!P382","v":0}]
[228217,"E",282,17,null,{"$f":"'COG-M'!P383","v":0}]
[228225,"E",282,25,null,{"$f":"'COG-M'!P384","v":0}]
[228226,"E",282,26,null,{"$f":"'COG-M'!P385","v":0}]
[228227,"E",282,27,null,{"$f":"'COG-M'!P386","v":0}]
[228311,"E",283,11,"Prendas de protección para seguridad pública y nacional",{"$f":"'COG-M'!P387","v":0}]
[228314,"E",283,14,null,{"$f":"'COG-M'!P388","v":0}]
[228315,"E",283,15,null,{"$f":"'COG-M'!P389","v":0}]
[228316,"E",283,16,null,{"$f":"'COG-M'!P390","v":0}]
[228317,"E",283,17,null,{"$f":"'COG-M'!P391","v":0}]
[228325,"E",283,25,null,{"$f":"'COG-M'!P392","v":0}]
[228326,"E",283,26,null,{"$f":"'COG-M'!P393","v":0}]
[228327,"E",283,27,null,{"$f":"'COG-M'!P394","v":0}]
[290000,"E",2900,{"v":0,"d":"00"},"HERRAMIENTAS, REFACCIONES Y ACCESORIOS MENORES",{"$f":"'COG-M'!P395","v":{"v":13956,"d":"13,956"}}]
[229111,"E",291,11,"Herramientas menores",{"$f":"'COG-M'!P396","v":0}]
[229114,"E",291,14,null,{"$f":"'COG-M'!P397","v":0}]
[229115,"E",291,15,null,{"$f":"'COG-M'!P398","v":0}]
[229116,"E",291,16,null,{"$f":"'COG-M'!P399","v":0}]
[229117,"E",291,17,null,{"$f":"'COG-M'!P400","v":0}]
[229211,"E",292,11,"Refacciones y accesorios menores de edificios",{"$f":"'COG-M'!P401","v":0}]
[229214,"E",292,14,null,{"$f":"'COG-M'!P402","v":0}]
[229215,"E",292,15,null,{"$f":"'COG-M'!P403","v":0}]
[229216,"E",292,16,null,{"$f":"'COG-M'!P404","v":0}]
[229217,"E",292,17,null,{"$f":"'COG-M'!P405","v":0}]
[229311,"E",293,11,"Refacciones y accesorios menores de mobiliario  y equipo de administración, educacional y recreativo",{"$f":"'COG-M'!P406","v":0}]
[229314,"E",293,14,null,{"$f":"'COG-M'!P407","v":0}]
[229315,"E",293,15,null,{"$f":"'COG-M'!P408","v":0}]
[229316,"E",293,16,null,{"$f":"'COG-M'!P409","v":0}]
[229317,"E",293,17,null,{"$f":"'COG-M'!P410","v":0}]
[229411,"E",294,11,"Refacciones y accesorios menores de equipo de cómputo y tecnologías de la información",{"$f":"'COG-M'!P411","v":0}]
[229414,"E",294,14,null,{"$f":"'COG-M'!P412","v":0}]
[229415,"E",294,15,null,{"$f":"'COG-M'!P413","v":0}]
[229416,"E",294,16,null,{"$f":"'COG-M'!P414","v":0}]
[229417,"E",294,17,null,{"$f":"'COG-M'!P415","v":0}]
[229511,"E",295,11,"Refacciones y accesorios menores de equipo e instrumental médico y de laboratorio",{"$f":"'COG-M'!P416","v":0}]
[229514,"E",295,14,null,{"$f":"'COG-M'!P417","v":0}]
[229515,"E",295,15,null,{"$f":"'COG-M'!P418","v":0}]
[229516,"E",295,16,null,{"$f":"'COG-M'!P419","v":0}]
[229517,"E",295,17,null,{"$f":"'COG-M'!P420","v":0}]
[229611,"E",296,11,"Refacciones y accesorios menores de equipo de transporte",{"$f":"'COG-M'!P421","v":{"v":13956,"d":"13,956"}}]
[229614,"E",296,14,null,{"$f":"'COG-M'!P422","v":0}]
[229615,"E",296,15,null,{"$f":"'COG-M'!P423","v":0}]
[229616,"E",296,16,null,{"$f":"'COG-M'!P424","v":0}]
[229617,"E",296,17,null,{"$f":"'COG-M'!P425","v":0}]
[229625,"E",296,25,null,{"$f":"'COG-M'!P426","v":0}]
[229711,"E",297,11,"Refacciones y accesorios menores de equipo de defensa y seguridad",{"$f":"'COG-M'!P427","v":0}]
[229714,"E",297,14,null,{"$f":"'COG-M'!P428","v":0}]
[229715,"E",297,15,null,{"$f":"'COG-M'!P429","v":0}]
[229716,"E",297,16,null,{"$f":"'COG-M'!P430","v":0}]
[229717,"E",297,17,null,{"$f":"'COG-M'!P431","v":0}]
[229725,"E",297,25,null,{"$f":"'COG-M'!P432","v":0}]
[229811,"E",298,11,"Refacciones y accesorios menores de maquinaria y otros equipos",{"$f":"'COG-M'!P433","v":0}]
[229814,"E",298,14,null,{"$f":"'COG-M'!P434","v":0}]
[229815,"E",298,15,null,{"$f":"'COG-M'!P435","v":0}]
[229816,"E",298,16,null,{"$f":"'COG-M'!P436","v":0}]
[229817,"E",298,17,null,{"$f":"'COG-M'!P437","v":0}]
[229911,"E",299,11,"Refacciones y accesorios menores otros bienes muebles",{"$f":"'COG-M'!P438","v":0}]
[229914,"E",299,14,null,{"$f":"'COG-M'!P439","v":0}]
[229915,"E",299,15,null,{"$f":"'COG-M'!P440","v":0}]
[229916,"E",299,16,null,{"$f":"'COG-M'!P441","v":0}]
[229917,"E",299,17,null,{"$f":"'COG-M'!P442","v":0}]
[300000,"E",3000,{"v":0,"d":"00"},"SERVICIOS GENERALES",{"$f":"'COG-M'!P443","v":{"v":255372,"d":"255,372"}}]
[310000,"E",3100,{"v":0,"d":"00"},"SERVICIOS BÁSICOS",{"$f":"'COG-M'!P444","v":{"v":93816,"d":"93,816"}}]
[331111,"E",311,11,"Energía eléctrica",{"$f":"'COG-M'!P445","v":{"v":33996,"d":"33,996"}}]
[331114,"E",311,14,null,{"$f":"'COG-M'!P446","v":0}]
[331115,"E",311,15,null,{"$f":"'COG-M'!P447","v":0}]
[331116,"E",311,16,null,{"$f":"'COG-M'!P448","v":0}]
[331117,"E",311,17,null,{"$f":"'COG-M'!P449","v":0}]
[331125,"E",311,25,null,{"$f":"'COG-M'!P450","v":0}]
[331211,"E",312,11,"Gas ",{"$f":"'COG-M'!P451","v":{"v":6804,"d":"6,804"}}]
[331214,"E",312,14,null,{"$f":"'COG-M'!P452","v":0}]
[331215,"E",312,15,null,{"$f":"'COG-M'!P453","v":0}]
[331216,"E",312,16,null,{"$f":"'COG-M'!P454","v":0}]
[331217,"E",312,17,null,{"$f":"'COG-M'!P455","v":0}]
[331311,"E",313,11,"Agua",{"$f":"'COG-M'!P456","v":{"v":13596,"d":"13,596"}}]
[331314,"E",313,14,null,{"$f":"'COG-M'!P457","v":0}]
[331315,"E",313,15,null,{"$f":"'COG-M'!P458","v":0}]
[331316,"E",313,16,null,{"$f":"'COG-M'!P459","v":0}]
[331317,"E",313,17,null,{"$f":"'COG-M'!P460","v":0}]
[331411,"E",314,11,"Telefonía tradicional",{"$f":"'COG-M'!P461","v":{"v":39420,"d":"39,420"}}]
[331414,"E",314,14,null,{"$f":"'COG-M'!P462","v":0}]
[331415,"E",314,15,null,{"$f":"'COG-M'!P463","v":0}]
[331416,"E",314,16,null,{"$f":"'COG-M'!P464","v":0}]
[331417,"E",314,17,null,{"$f":"'COG-M'!P465","v":0}]
[331511,"E",315,11,"Telefonía celular",{"$f":"'COG-M'!P466","v":0}]
[331514,"E",315,14,null,{"$f":"'COG-M'!P467","v":0}]
[331515,"E",315,15,null,{"$f":"'COG-M'!P468","v":0}]
[331516,"E",315,16,null,{"$f":"'COG-M'!P469","v":0}]
[331517,"E",315,17,null,{"$f":"'COG-M'!P470","v":0}]
[331611,"E",316,11,"Servicios de telecomunicaciones y satélites",{"$f":"'COG-M'!P471","v":0}]
[331614,"E",316,14,null,{"$f":"'COG-M'!P472","v":0}]
[331615,"E",316,15,null,{"$f":"'COG-M'!P473","v":0}]
[331616,"E",316,16,null,{"$f":"'COG-M'!P474","v":0}]
[331617,"E",316,17,null,{"$f":"'COG-M'!P475","v":0}]
[331711,"E",317,11,"Servicios de acceso de Internet, redes y procesamiento de información",{"$f":"'COG-M'!P476","v":0}]
[331714,"E",317,14,null,{"$f":"'COG-M'!P477","v":0}]
[331715,"E",317,15,null,{"$f":"'COG-M'!P478","v":0}]
[331716,"E",317,16,null,{"$f":"'COG-M'!P479","v":0}]
[331717,"E",317,17,null,{"$f":"'COG-M'!P480","v":0}]
[331811,"E",318,11,"Servicios postales y telegráficos",{"$f":"'COG-M'!P481","v":0}]
[331814,"E",318,14,null,{"$f":"'COG-M'!P482","v":0}]
[331815,"E",318,15,null,{"$f":"'COG-M'!P483","v":0}]
[331816,"E",318,16,null,{"$f":"'COG-M'!P484","v":0}]
[331817,"E",318,17,null,{"$f":"'COG-M'!P485","v":0}]
[331911,"E",319,11,"Servicios integrales y otros servicios",{"$f":"'COG-M'!P486","v":0}]
[331914,"E",319,14,null,{"$f":"'COG-M'!P487","v":0}]
[331915,"E",319,15,null,{"$f":"'COG-M'!P488","v":0}]
[331916,"E",319,16,null,{"$f":"'COG-M'!P489","v":0}]
[331917,"E",319,17,null,{"$f":"'COG-M'!P490","v":0}]
[320000,"E",3200,{"v":0,"d":"00"},"SERVICIOS DE ARRENDAMIENTO",{"$f":"'COG-M'!P491","v":0}]
[332111,"E",321,11,"Arrendamiento de terrenos",{"$f":"'COG-M'!P492","v":0}]
[332114,"E",321,14,null,{"$f":"'COG-M'!P493","v":0}]
[332115,"E",321,15,null,{"$f":"'COG-M'!P494","v":0}]
[332116,"E",321,16,null,{"$f":"'COG-M'!P495","v":0}]
[332117,"E",321,17,null,{"$f":"'COG-M'!P496","v":0}]
[332211,"E",322,11,"Arrendamiento de edificios",{"$f":"'COG-M'!P497","v":0}]
[332214,"E",322,14,null,{"$f":"'COG-M'!P498","v":0}]
[332215,"E",322,15,null,{"$f":"'COG-M'!P499","v":0}]
[332216,"E",322,16,null,{"$f":"'COG-M'!P500","v":0}]
[332217,"E",322,17,null,{"$f":"'COG-M'!P501","v":0}]
[332225,"E",322,25,null,{"$f":"'COG-M'!P502","v":0}]
[332311,"E",323,11,"Arrendamiento de mobiliario y equipo de administración, educacional y recreativo",{"$f":"'COG-M'!P503","v":0}]
[332314,"E",323,14,null,{"$f":"'COG-M'!P504","v":0}]
[332315,"E",323,15,null,{"$f":"'COG-M'!P505","v":0}]
[332316,"E",323,16,null,{"$f":"'COG-M'!P506","v":0}]
[332317,"E",323,17,null,{"$f":"'COG-M'!P507","v":0}]
[332411,"E",324,11,"Arrendamiento de equipo e instrumental médico y de laboratorio",{"$f":"'COG-M'!P508","v":0}]
[332414,"E",324,14,null,{"$f":"'COG-M'!P509","v":0}]
[332415,"E",324,15,null,{"$f":"'COG-M'!P510","v":0}]
[332416,"E",324,16,null,{"$f":"'COG-M'!P511","v":0}]
[332417,"E",324,17,null,{"$f":"'COG-M'!P512","v":0}]
[332511,"E",325,11,"Arrendamiento de equipo de transporte",{"$f":"'COG-M'!P513","v":0}]
[332514,"E",325,14,null,{"$f":"'COG-M'!P514","v":0}]
[332515,"E",325,15,null,{"$f":"'COG-M'!P515","v":0}]
[332516,"E",325,16,null,{"$f":"'COG-M'!P516","v":0}]
[332517,"E",325,17,null,{"$f":"'COG-M'!P517","v":0}]
[332611,"E",326,11,"Arrendamiento de maquinaria, otros equipos y herramientas",{"$f":"'COG-M'!P518","v":0}]
[332614,"E",326,14,null,{"$f":"'COG-M'!P519","v":0}]
[332615,"E",326,15,null,{"$f":"'COG-M'!P520","v":0}]
[332616,"E",326,16,null,{"$f":"'COG-M'!P521","v":0}]
[332617,"E",326,17,null,{"$f":"'COG-M'!P522","v":0}]
[332625,"E",326,25,null,{"$f":"'COG-M'!P523","v":0}]
[332711,"E",327,11,"Arrendamiento de activos intangibles",{"$f":"'COG-M'!P524","v":0}]
[332714,"E",327,14,null,{"$f":"'COG-M'!P525","v":0}]
[332715,"E",327,15,null,{"$f":"'COG-M'!P526","v":0}]
[332716,"E",327,16,null,{"$f":"'COG-M'!P527","v":0}]
[332717,"E",327,17,null,{"$f":"'COG-M'!P528","v":0}]
[332811,"E",328,11,"Arrendamiento financiero",{"$f":"'COG-M'!P529","v":0}]
[332814,"E",328,14,null,{"$f":"'COG-M'!P530","v":0}]
[332815,"E",328,15,null,{"$f":"'COG-M'!P531","v":0}]
[332816,"E",328,16,null,{"$f":"'COG-M'!P532","v":0}]
[332817,"E",328,17,null,{"$f":"'COG-M'!P533","v":0}]
[332825,"E",328,25,null,{"$f":"'COG-M'!P534","v":0}]
[332911,"E",329,11,"Otros arrendamientos",{"$f":"'COG-M'!P535","v":0}]
[332914,"E",329,14,null,{"$f":"'COG-M'!P536","v":0}]
[332915,"E",329,15,null,{"$f":"'COG-M'!P537","v":0}]
[332916,"E",329,16,null,{"$f":"'COG-M'!P538","v":0}]
[332917,"E",329,17,null,{"$f":"'COG-M'!P539","v":0}]
[330000,"E",3300,{"v":0,"d":"00"},"SERVICIOS PROFESIONALES, CIENTÍFICOS, TÉCNICOS Y OTROS SERVICIOS",{"$f":"'COG-M'!P540","v":{"v":130488,"d":"130,488"}}]
[333111,"E",331,11,"Servicios legales, de contabilidad, auditoría y relacionados",{"$f":"'COG-M'!P541","v":{"v":130488,"d":"130,488"}}]
[333114,"E",331,14,null,{"$f":"'COG-M'!P542","v":0}]
[333115,"E",331,15,null,{"$f":"'COG-M'!P543","v":0}]
[333116,"E",331,16,null,{"$f":"'COG-M'!P544","v":0}]
[333117,"E",331,17,null,{"$f":"'COG-M'!P545","v":0}]
[333211,"E",332,11,"Servicios de diseño, arquitectura, ingeniería y actividades relacionadas",{"$f":"'COG-M'!P546","v":0}]
[333214,"E",332,14,null,{"$f":"'COG-M'!P547","v":0}]
[333215,"E",332,15,null,{"$f":"'COG-M'!P548","v":0}]
[333216,"E",332,16,null,{"$f":"'COG-M'!P549","v":0}]
[333217,"E",332,17,null,{"$f":"'COG-M'!P550","v":0}]
[333225,"E",332,25,null,{"$f":"'COG-M'!P551","v":0}]
[333311,"E",333,11,"Servicios de consultoría administrativa, procesos, técnica y en tecnologías de la información",{"$f":"'COG-M'!P552","v":0}]
[333314,"E",333,14,null,{"$f":"'COG-M'!P553","v":0}]
[333315,"E",333,15,null,{"$f":"'COG-M'!P554","v":0}]
[333316,"E",333,16,null,{"$f":"'COG-M'!P555","v":0}]
[333317,"E",333,17,null,{"$f":"'COG-M'!P556","v":0}]
[333411,"E",334,11,"Servicios de capacitación",{"$f":"'COG-M'!P557","v":0}]
[333414,"E",334,14,null,{"$f":"'COG-M'!P558","v":0}]
[333415,"E",334,15,null,{"$f":"'COG-M'!P559","v":0}]
[333416,"E",334,16,null,{"$f":"'COG-M'!P560","v":0}]
[333417,"E",334,17,null,{"$f":"'COG-M'!P561","v":0}]
[333511,"E",335,11,"Servicios de investigación científica y desarrollo",{"$f":"'COG-M'!P562","v":0}]
[333514,"E",335,14,null,{"$f":"'COG-M'!P563","v":0}]
[333515,"E",335,15,null,{"$f":"'COG-M'!P564","v":0}]
[333516,"E",335,16,null,{"$f":"'COG-M'!P565","v":0}]
[333517,"E",335,17,null,{"$f":"'COG-M'!P566","v":0}]
[333611,"E",336,11,"Servicios de apoyo administrativo, traducción, fotocopiado e impresión",{"$f":"'COG-M'!P567","v":0}]
[333614,"E",336,14,null,{"$f":"'COG-M'!P568","v":0}]
[333615,"E",336,15,null,{"$f":"'COG-M'!P569","v":0}]
[333616,"E",336,16,null,{"$f":"'COG-M'!P570","v":0}]
[333617,"E",336,17,null,{"$f":"'COG-M'!P571","v":0}]
[333711,"E",337,11,"Servicios de protección y seguridad",{"$f":"'COG-M'!P572","v":0}]
[333714,"E",337,14,null,{"$f":"'COG-M'!P573","v":0}]
[333715,"E",337,15,null,{"$f":"'COG-M'!P574","v":0}]
[333716,"E",337,16,null,{"$f":"'COG-M'!P575","v":0}]
[333717,"E",337,17,null,{"$f":"'COG-M'!P576","v":0}]
[333811,"E",338,11,"Servicios de vigilancia",{"$f":"'COG-M'!P577","v":0}]
[333814,"E",338,14,null,{"$f":"'COG-M'!P578","v":0}]
[333815,"E",338,15,null,{"$f":"'COG-M'!P579","v":0}]
[333816,"E",338,16,null,{"$f":"'COG-M'!P580","v":0}]
[333817,"E",338,17,null,{"$f":"'COG-M'!P581","v":0}]
[333911,"E",339,11,"Servicios profesionales, científicos y técnicos integrales",{"$f":"'COG-M'!P582","v":0}]
[333914,"E",339,14,null,{"$f":"'COG-M'!P583","v":0}]
[333915,"E",339,15,null,{"$f":"'COG-M'!P584","v":0}]
[333916,"E",339,16,null,{"$f":"'COG-M'!P585","v":0}]
[333917,"E",339,17,null,{"$f":"'COG-M'!P586","v":0}]
[340000,"E",3400,{"v":0,"d":"00"},"SERVICIOS FINANCIEROS, BANCARIOS Y COMERCIALES",{"$f":"'COG-M'!P587","v":0}]
[334111,"E",341,11,"Servicios financieros y bancarios",{"$f":"'COG-M'!P588","v":0}]
[334114,"E",341,14,null,{"$f":"'COG-M'!P589","v":0}]
[334115,"E",341,15,null,{"$f":"'COG-M'!P590","v":0}]
[334116,"E",341,16,null,{"$f":"'COG-M'!P591","v":0}]
[334117,"E",341,17,null,{"$f":"'COG-M'!P592","v":0}]
[334125,"E",341,25,null,{"$f":"'COG-M'!P593","v":0}]
[334126,"E",341,26,null,{"$f":"'COG-M'!P594","v":0}]
[334127,"E",341,27,null,{"$f":"'COG-M'!P595","v":0}]
[334211,"E",342,11,"Servicios de cobranza, investigación crediticia y similar",{"$f":"'COG-M'!P596","v":0}]
[334214,"E",342,14,null,{"$f":"'COG-M'!P597","v":0}]
[334215,"E",342,15,null,{"$f":"'COG-M'!P598","v":0}]
[334216,"E",342,16,null,{"$f":"'COG-M'!P599","v":0}]
[334217,"E",342,17,null,{"$f":"'COG-M'!P600","v":0}]
[334311,"E",343,11,"Servicios de recaudación, traslado y custodia de valores",{"$f":"'COG-M'!P601","v":0}]
[334314,"E",343,14,null,{"$f":"'COG-M'!P602","v":0}]
[334315,"E",343,15,null,{"$f":"'COG-M'!P603","v":0}]
[334316,"E",343,16,null,{"$f":"'COG-M'!P604","v":0}]
[334317,"E",343,17,null,{"$f":"'COG-M'!P605","v":0}]
[334325,"E",343,25,null,{"$f":"'COG-M'!P606","v":0}]
[334326,"E",343,26,null,{"$f":"'COG-M'!P607","v":0}]
[334327,"E",343,27,null,{"$f":"'COG-M'!P608","v":0}]
[334411,"E",344,11,"Seguros de responsabilidad patrimonial y fianzas",{"$f":"'COG-M'!P609","v":0}]
[334414,"E",344,14,null,{"$f":"'COG-M'!P610","v":0}]
[334415,"E",344,15,null,{"$f":"'COG-M'!P611","v":0}]
[334416,"E",344,16,null,{"$f":"'COG-M'!P612","v":0}]
[334417,"E",344,17,null,{"$f":"'COG-M'!P613","v":0}]
[334511,"E",345,11,"Seguro de bienes patrimoniales",{"$f":"'COG-M'!P614","v":0}]
[334514,"E",345,14,null,{"$f":"'COG-M'!P615","v":0}]
[334515,"E",345,15,null,{"$f":"'COG-M'!P616","v":0}]
[334516,"E",345,16,null,{"$f":"'COG-M'!P617","v":0}]
[334517,"E",345,17,null,{"$f":"'COG-M'!P618","v":0}]
[334611,"E",346,11,"Almacenaje, envase y embalaje",{"$f":"'COG-M'!P619","v":0}]
[334614,"E",346,14,null,{"$f":"'COG-M'!P620","v":0}]
[334615,"E",346,15,null,{"$f":"'COG-M'!P621","v":0}]
[334616,"E",346,16,null,{"$f":"'COG-M'!P622","v":0}]
[334617,"E",346,17,null,{"$f":"'COG-M'!P623","v":0}]
[334711,"E",347,11,"Fletes y maniobras",{"$f":"'COG-M'!P624","v":0}]
[334714,"E",347,14,null,{"$f":"'COG-M'!P625","v":0}]
[334715,"E",347,15,null,{"$f":"'COG-M'!P626","v":0}]
[334716,"E",347,16,null,{"$f":"'COG-M'!P627","v":0}]
[334717,"E",347,17,null,{"$f":"'COG-M'!P628","v":0}]
[334811,"E",348,11,"Comisiones por ventas",{"$f":"'COG-M'!P629","v":0}]
[334814,"E",348,14,null,{"$f":"'COG-M'!P630","v":0}]
[334815,"E",348,15,null,{"$f":"'COG-M'!P631","v":0}]
[334816,"E",348,16,null,{"$f":"'COG-M'!P632","v":0}]
[334817,"E",348,17,null,{"$f":"'COG-M'!P633","v":0}]
[334911,"E",349,11,"Servicios financieros, bancarios y comerciales integrales",{"$f":"'COG-M'!P634","v":0}]
[334914,"E",349,14,null,{"$f":"'COG-M'!P635","v":0}]
[334915,"E",349,15,null,{"$f":"'COG-M'!P636","v":0}]
[334916,"E",349,16,null,{"$f":"'COG-M'!P637","v":0}]
[334917,"E",349,17,null,{"$f":"'COG-M'!P638","v":0}]
[350000,"E",3500,{"v":0,"d":"00"},"SERVICIOS DE INSTALACIÓN, REPARACIÓN, MANTENIMIENTO Y CONSERVACIÓN",{"$f":"'COG-M'!P639","v":0}]
[335111,"E",351,11,"Conservación y mantenimiento menor de inmuebles",{"$f":"'COG-M'!P640","v":0}]
[335114,"E",351,14,null,{"$f":"'COG-M'!P641","v":0}]
[335115,"E",351,15,null,{"$f":"'COG-M'!P642","v":0}]
[335116,"E",351,16,null,{"$f":"'COG-M'!P643","v":0}]
[335117,"E",351,17,null,{"$f":"'COG-M'!P644","v":0}]
[335211,"E",352,11,"Instalación, reparación y mantenimiento de mobiliario y equipo de administración, educacional y recreativo",{"$f":"'COG-M'!P645","v":0}]
[335214,"E",352,14,null,{"$f":"'COG-M'!P646","v":0}]
[335215,"E",352,15,null,{"$f":"'COG-M'!P647","v":0}]
[335216,"E",352,16,null,{"$f":"'COG-M'!P648","v":0}]
[335217,"E",352,17,null,{"$f":"'COG-M'!P649","v":0}]
[335311,"E",353,11,"Instalación, reparación y mantenimiento de equipo de cómputo y tecnología de la información",{"$f":"'COG-M'!P650","v":0}]
[335314,"E",353,14,null,{"$f":"'COG-M'!P651","v":0}]
[335315,"E",353,15,null,{"$f":"'COG-M'!P652","v":0}]
[335316,"E",353,16,null,{"$f":"'COG-M'!P653","v":0}]
[335317,"E",353,17,null,{"$f":"'COG-M'!P654","v":0}]
[335411,"E",354,11,"Instalación, reparación y mantenimiento de equipo e instrumental médico y de laboratorio",{"$f":"'COG-M'!P655","v":0}]
[335414,"E",354,14,null,{"$f":"'COG-M'!P656","v":0}]
[335415,"E",354,15,null,{"$f":"'COG-M'!P657","v":0}]
[335416,"E",354,16,null,{"$f":"'COG-M'!P658","v":0}]
[335417,"E",354,17,null,{"$f":"'COG-M'!P659","v":0}]
[335511,"E",355,11,"Reparación y mantenimiento de equipo de transporte",{"$f":"'COG-M'!P660","v":0}]
[335514,"E",355,14,null,{"$f":"'COG-M'!P661","v":0}]
[335515,"E",355,15,null,{"$f":"'COG-M'!P662","v":0}]
[335516,"E",355,16,null,{"$f":"'COG-M'!P663","v":0}]
[335517,"E",355,17,null,{"$f":"'COG-M'!P664","v":0}]
[335525,"E",355,25,null,{"$f":"'COG-M'!P665","v":0}]
[335611,"E",356,11,"Reparación y mantenimiento de equipo de defensa y seguridad",{"$f":"'COG-M'!P666","v":0}]
[335614,"E",356,14,null,{"$f":"'COG-M'!P667","v":0}]
[335615,"E",356,15,null,{"$f":"'COG-M'!P668","v":0}]
[335616,"E",356,16,null,{"$f":"'COG-M'!P669","v":0}]
[335617,"E",356,17,null,{"$f":"'COG-M'!P670","v":0}]
[335625,"E",356,25,null,{"$f":"'COG-M'!P671","v":0}]
[335711,"E",357,11,"Instalación, reparación y mantenimiento de maquinaria, otros equipos y herramienta",{"$f":"'COG-M'!P672","v":0}]
[335714,"E",357,14,null,{"$f":"'COG-M'!P673","v":0}]
[335715,"E",357,15,null,{"$f":"'COG-M'!P674","v":0}]
[335716,"E",357,16,null,{"$f":"'COG-M'!P675","v":0}]
[335717,"E",357,17,null,{"$f":"'COG-M'!P676","v":0}]
[335811,"E",358,11,"Servicios de limpieza y manejo de desechos",{"$f":"'COG-M'!P677","v":0}]
[335814,"E",358,14,null,{"$f":"'COG-M'!P678","v":0}]
[335815,"E",358,15,null,{"$f":"'COG-M'!P679","v":0}]
[335816,"E",358,16,null,{"$f":"'COG-M'!P680","v":0}]
[335817,"E",358,17,null,{"$f":"'COG-M'!P681","v":0}]
[335911,"E",359,11,"Servicios de jardinería y fumigación",{"$f":"'COG-M'!P682","v":0}]
[335914,"E",359,14,null,{"$f":"'COG-M'!P683","v":0}]
[335915,"E",359,15,null,{"$f":"'COG-M'!P684","v":0}]
[335916,"E",359,16,null,{"$f":"'COG-M'!P685","v":0}]
[335917,"E",359,17,null,{"$f":"'COG-M'!P686","v":0}]
[360000,"E",3600,{"v":0,"d":"00"},"SERVICIOS DE COMUNICACIÓN SOCIAL Y PUBLICIDAD",{"$f":"'COG-M'!P687","v":0}]
[336111,"E",361,11,"Difusión por radio, televisión y otros medios de mensajes sobre programas y actividades gubernamentales",{"$f":"'COG-M'!P688","v":0}]
[336114,"E",361,14,null,{"$f":"'COG-M'!P689","v":0}]
[336115,"E",361,15,null,{"$f":"'COG-M'!P690","v":0}]
[336116,"E",361,16,null,{"$f":"'COG-M'!P691","v":0}]
[336117,"E",361,17,null,{"$f":"'COG-M'!P692","v":0}]
[336211,"E",362,11,"Difusión por radio,  televisión y otros medios de mensajes comerciales para promover la venta de bienes o servicios",{"$f":"'COG-M'!P693","v":0}]
[336214,"E",362,14,null,{"$f":"'COG-M'!P694","v":0}]
[336215,"E",362,15,null,{"$f":"'COG-M'!P695","v":0}]
[336216,"E",362,16,null,{"$f":"'COG-M'!P696","v":0}]
[336217,"E",362,17,null,{"$f":"'COG-M'!P697","v":0}]
[336311,"E",363,11,"Servicios de creatividad, preproducción y producción de publicidad, excepto Internet",{"$f":"'COG-M'!P698","v":0}]
[336314,"E",363,14,null,{"$f":"'COG-M'!P699","v":0}]
[336315,"E",363,15,null,{"$f":"'COG-M'!P700","v":0}]
[336316,"E",363,16,null,{"$f":"'COG-M'!P701","v":0}]
[336317,"E",363,17,null,{"$f":"'COG-M'!P702","v":0}]
[336411,"E",364,11,"Servicios de revelado de  fotografías",{"$f":"'COG-M'!P703","v":0}]
[336414,"E",364,14,null,{"$f":"'COG-M'!P704","v":0}]
[336415,"E",364,15,null,{"$f":"'COG-M'!P705","v":0}]
[336416,"E",364,16,null,{"$f":"'COG-M'!P706","v":0}]
[336417,"E",364,17,null,{"$f":"'COG-M'!P707","v":0}]
[336511,"E",365,11,"Servicios de la industria fílmica, del sonido y del video",{"$f":"'COG-M'!P708","v":0}]
[336514,"E",365,14,null,{"$f":"'COG-M'!P709","v":0}]
[336515,"E",365,15,null,{"$f":"'COG-M'!P710","v":0}]
[336516,"E",365,16,null,{"$f":"'COG-M'!P711","v":0}]
[336517,"E",365,17,null,{"$f":"'COG-M'!P712","v":0}]
[336611,"E",366,11,"Servicio de creación y difusión de contenido exclusivamente a través de Internet",{"$f":"'COG-M'!P713","v":0}]
[336614,"E",366,14,null,{"$f":"'COG-M'!P714","v":0}]
[336615,"E",366,15,null,{"$f":"'COG-M'!P715","v":0}]
[336616,"E",366,16,null,{"$f":"'COG-M'!P716","v":0}]
[336617,"E",366,17,null,{"$f":"'COG-M'!P717","v":0}]
[336911,"E",369,11,"Otros servicios de información",{"$f":"'COG-M'!P718","v":0}]
[336914,"E",369,14,null,{"$f":"'COG-M'!P719","v":0}]
[336915,"E",369,15,null,{"$f":"'COG-M'!P720","v":0}]
[336916,"E",369,16,null,{"$f":"'COG-M'!P721","v":0}]
[336917,"E",369,17,null,{"$f":"'COG-M'!P722","v":0}]
[370000,"E",3700,{"v":0,"d":"00"},"SERVICIOS DE TRASLADO Y VIÁTICOS",{"$f":"'COG-M'!P723","v":{"v":31068,"d":"31,068"}}]
[337111,"E",371,11,"Pasajes aéreos",{"$f":"'COG-M'!P724","v":0}]
[337114,"E",371,14,null,{"$f":"'COG-M'!P725","v":0}]
[337115,"E",371,15,null,{"$f":"'COG-M'!P726","v":0}]
[337116,"E",371,16,null,{"$f":"'COG-M'!P727","v":0}]
[337117,"E",371,17,null,{"$f":"'COG-M'!P728","v":0}]
[337211,"E",372,11,"Pasajes terrestres",{"$f":"'COG-M'!P729","v":{"v":31068,"d":"31,068"}}]
[337214,"E",372,14,null,{"$f":"'COG-M'!P730","v":0}]
[337215,"E",372,15,null,{"$f":"'COG-M'!P731","v":0}]
[337216,"E",372,16,null,{"$f":"'COG-M'!P732","v":0}]
[337217,"E",372,17,null,{"$f":"'COG-M'!P733","v":0}]
[337311,"E",373,11,"Pasajes marítimos, lacustres y fluviales",{"$f":"'COG-M'!P734","v":0}]
[337314,"E",373,14,null,{"$f":"'COG-M'!P735","v":0}]
[337315,"E",373,15,null,{"$f":"'COG-M'!P736","v":0}]
[337316,"E",373,16,null,{"$f":"'COG-M'!P737","v":0}]
[337317,"E",373,17,null,{"$f":"'COG-M'!P738","v":0}]
[337411,"E",374,11,"Autotransporte",{"$f":"'COG-M'!P739","v":0}]
[337414,"E",374,14,null,{"$f":"'COG-M'!P740","v":0}]
[337415,"E",374,15,null,{"$f":"'COG-M'!P741","v":0}]
[337416,"E",374,16,null,{"$f":"'COG-M'!P742","v":0}]
[337417,"E",374,17,null,{"$f":"'COG-M'!P743","v":0}]
[337511,"E",375,11,"Viáticos en el país",{"$f":"'COG-M'!P744","v":0}]
[337514,"E",375,14,null,{"$f":"'COG-M'!P745","v":0}]
[337515,"E",375,15,null,{"$f":"'COG-M'!P746","v":0}]
[337516,"E",375,16,null,{"$f":"'COG-M'!P747","v":0}]
[337517,"E",375,17,null,{"$f":"'COG-M'!P748","v":0}]
[337611,"E",376,11,"Viáticos en el extranjero ",{"$f":"'COG-M'!P749","v":0}]
[337614,"E",376,14,null,{"$f":"'COG-M'!P750","v":0}]
[337615,"E",376,15,null,{"$f":"'COG-M'!P751","v":0}]
[337616,"E",376,16,null,{"$f":"'COG-M'!P752","v":0}]
[337617,"E",376,17,null,{"$f":"'COG-M'!P753","v":0}]
[337711,"E",377,11,"Gastos de instalación y traslado de menaje",{"$f":"'COG-M'!P754","v":0}]
[337714,"E",377,14,null,{"$f":"'COG-M'!P755","v":0}]
[337715,"E",377,15,null,{"$f":"'COG-M'!P756","v":0}]
[337716,"E",377,16,null,{"$f":"'COG-M'!P757","v":0}]
[337717,"E",377,17,null,{"$f":"'COG-M'!P758","v":0}]
[337811,"E",378,11,"Servicios integrales de traslado y viáticos",{"$f":"'COG-M'!P759","v":0}]
[337814,"E",378,14,null,{"$f":"'COG-M'!P760","v":0}]
[337815,"E",378,15,null,{"$f":"'COG-M'!P761","v":0}]
[337816,"E",378,16,null,{"$f":"'COG-M'!P762","v":0}]
[337817,"E",378,17,null,{"$f":"'COG-M'!P763","v":0}]
[337911,"E",379,11,"Otros servicios de traslado y hospedaje",{"$f":"'COG-M'!P764","v":0}]
[337914,"E",379,14,null,{"$f":"'COG-M'!P765","v":0}]
[337915,"E",379,15,null,{"$f":"'COG-M'!P766","v":0}]
[337916,"E",379,16,null,{"$f":"'COG-M'!P767","v":0}]
[337917,"E",379,17,null,{"$f":"'COG-M'!P768","v":0}]
[380000,"E",3800,{"v":0,"d":"00"},"SERVICIOS OFICIALES",{"$f":"'COG-M'!P769","v":0}]
[338111,"E",381,11,"Gastos de ceremonial",{"$f":"'COG-M'!P770","v":0}]
[338114,"E",381,14,null,{"$f":"'COG-M'!P771","v":0}]
[338115,"E",381,15,null,{"$f":"'COG-M'!P772","v":0}]
[338116,"E",381,16,null,{"$f":"'COG-M'!P773","v":0}]
[338117,"E",381,17,null,{"$f":"'COG-M'!P774","v":0}]
[338211,"E",382,11,"Gastos de orden  social y cultural",{"$f":"'COG-M'!P775","v":0}]
[338214,"E",382,14,null,{"$f":"'COG-M'!P776","v":0}]
[338215,"E",382,15,null,{"$f":"'COG-M'!P777","v":0}]
[338216,"E",382,16,null,{"$f":"'COG-M'!P778","v":0}]
[338217,"E",382,17,null,{"$f":"'COG-M'!P779","v":0}]
[338311,"E",383,11,"Congresos y convenciones",{"$f":"'COG-M'!P780","v":0}]
[338314,"E",383,14,null,{"$f":"'COG-M'!P781","v":0}]
[338315,"E",383,15,null,{"$f":"'COG-M'!P782","v":0}]
[338316,"E",383,16,null,{"$f":"'COG-M'!P783","v":0}]
[338317,"E",383,17,null,{"$f":"'COG-M'!P784","v":0}]
[338411,"E",384,11,"Exposiciones",{"$f":"'COG-M'!P785","v":0}]
[338414,"E",384,14,null,{"$f":"'COG-M'!P786","v":0}]
[338415,"E",384,15,null,{"$f":"'COG-M'!P787","v":0}]
[338416,"E",384,16,null,{"$f":"'COG-M'!P788","v":0}]
[338417,"E",384,17,null,{"$f":"'COG-M'!P789","v":0}]
[338511,"E",385,11,"Gastos de representación",{"$f":"'COG-M'!P790","v":0}]
[338514,"E",385,14,null,{"$f":"'COG-M'!P791","v":0}]
[338515,"E",385,15,null,{"$f":"'COG-M'!P792","v":0}]
[338516,"E",385,16,null,{"$f":"'COG-M'!P793","v":0}]
[338517,"E",385,17,null,{"$f":"'COG-M'!P794","v":0}]
[390000,"E",3900,{"v":0,"d":"00"},"OTROS SERVICIOS GENERALES",{"$f":"'COG-M'!P795","v":0}]
[339111,"E",391,11,"Servicios funerarios y de cementerios",{"$f":"'COG-M'!P796","v":0}]
[339114,"E",391,14,null,{"$f":"'COG-M'!P797","v":0}]
[339115,"E",391,15,null,{"$f":"'COG-M'!P798","v":0}]
[339116,"E",391,16,null,{"$f":"'COG-M'!P799","v":0}]
[339117,"E",391,17,null,{"$f":"'COG-M'!P800","v":0}]
[339211,"E",392,11,"Impuestos y derechos",{"$f":"'COG-M'!P801","v":0}]
[339214,"E",392,14,null,{"$f":"'COG-M'!P802","v":0}]
[339215,"E",392,15,null,{"$f":"'COG-M'!P803","v":0}]
[339216,"E",392,16,null,{"$f":"'COG-M'!P804","v":0}]
[339217,"E",392,17,null,{"$f":"'COG-M'!P805","v":0}]
[339311,"E",393,11,"Impuestos y derechos de importación",{"$f":"'COG-M'!P806","v":0}]
[339314,"E",393,14,null,{"$f":"'COG-M'!P807","v":0}]
[339315,"E",393,15,null,{"$f":"'COG-M'!P808","v":0}]
[339316,"E",393,16,null,{"$f":"'COG-M'!P809","v":0}]
[339317,"E",393,17,null,{"$f":"'COG-M'!P810","v":0}]
[339411,"E",394,11,"Sentencias y resoluciones por autoridad competente",{"$f":"'COG-M'!P811","v":0}]
[339414,"E",394,14,null,{"$f":"'COG-M'!P812","v":0}]
[339415,"E",394,15,null,{"$f":"'COG-M'!P813","v":0}]
[339416,"E",394,16,null,{"$f":"'COG-M'!P814","v":0}]
[339417,"E",394,17,null,{"$f":"'COG-M'!P815","v":0}]
[339511,"E",395,11,"Penas, multas, accesorios y actualizaciones",{"$f":"'COG-M'!P816","v":0}]
[339514,"E",395,14,null,{"$f":"'COG-M'!P817","v":0}]
[339515,"E",395,15,null,{"$f":"'COG-M'!P818","v":0}]
[339516,"E",395,16,null,{"$f":"'COG-M'!P819","v":0}]
[339517,"E",395,17,null,{"$f":"'COG-M'!P820","v":0}]
[339611,"E",396,11,"Otros gastos por responsabilidades",{"$f":"'COG-M'!P821","v":0}]
[339614,"E",396,14,null,{"$f":"'COG-M'!P822","v":0}]
[339615,"E",396,15,null,{"$f":"'COG-M'!P823","v":0}]
[339616,"E",396,16,null,{"$f":"'COG-M'!P824","v":0}]
[339617,"E",396,17,null,{"$f":"'COG-M'!P825","v":0}]
[339700,"E",397,{"v":0,"d":"00"},"Utilidades",{"$f":"'COG-M'!P826","v":0}]
[339811,"E",398,11,"Impuesto sobre nómina y otros que se deriven de una relación laboral",{"$f":"'COG-M'!P827","v":0}]
[339814,"E",398,14,null,{"$f":"'COG-M'!P828","v":0}]
[339815,"E",398,15,null,{"$f":"'COG-M'!P829","v":0}]
[339816,"E",398,16,null,{"$f":"'COG-M'!P830","v":0}]
[339817,"E",398,17,null,{"$f":"'COG-M'!P831","v":0}]
[339911,"E",399,11,"Otros servicios generales",{"$f":"'COG-M'!P832","v":0}]
[339914,"E",399,14,null,{"$f":"'COG-M'!P833","v":0}]
[339915,"E",399,15,null,{"$f":"'COG-M'!P834","v":0}]
[339916,"E",399,16,null,{"$f":"'COG-M'!P835","v":0}]
[339917,"E",399,17,null,{"$f":"'COG-M'!P836","v":0}]
[400000,"E",4000,{"v":0,"d":"00"},"TRANSFERENCIAS, ASIGNACIONES, SUBSIDIOS Y OTRAS  AYUDAS",{"$f":"'COG-M'!P837","v":{"v":69816,"d":"69,816"}}]
[410000,"E",4100,{"v":0,"d":"00"},"TRANSFERENCIAS INTERNAS Y ASIGNACIONES AL SECTOR PÚBLICO",{"$f":"'COG-M'!P838","v":0}]
[441100,"E",411,{"v":0,"d":"00"},"Asignaciones presupuestarias al Poder Ejecutivo",{"$f":"'COG-M'!P839","v":0}]
[441200,"E",412,{"v":0,"d":"00"},"Asignaciones presupuestarias al Poder Legislativo",{"$f":"'COG-M'!P840","v":0}]
[441300,"E",413,{"v":0,"d":"00"},"Asignaciones presupuestarias al Poder Judicial",{"$f":"'COG-M'!P841","v":0}]
[441400,"E",414,{"v":0,"d":"00"},"Asignaciones presupuestarias a Órganos Autónomos",{"$f":"'COG-M'!P842","v":0}]
[441511,"E",415,11,"Transferencias internas otorgadas a entidades paraestatales no empresariales y no financieras",{"$f":"'COG-M'!P843","v":0}]
[441514,"E",415,14,null,{"$f":"'COG-M'!P844","v":0}]
[441515,"E",415,15,null,{"$f":"'COG-M'!P845","v":0}]
[441516,"E",415,16,null,{"$f":"'COG-M'!P846","v":0}]
[441517,"E",415,17,null,{"$f":"'COG-M'!P847","v":0}]
[441600,"E",416,{"v":0,"d":"00"},"Transferencias internas otorgadas a entidades paraestatales empresariales y no financieras",{"$f":"'COG-M'!P848","v":0}]
[441711,"E",417,11,"Transferencias internas otorgadas a fideicomisos públicos empresariales y no financieros",{"$f":"'COG-M'!P849","v":0}]
[441714,"E",417,14,null,{"$f":"'COG-M'!P850","v":0}]
[441715,"E",417,15,null,{"$f":"'COG-M'!P851","v":0}]
[441716,"E",417,16,null,{"$f":"'COG-M'!P852","v":0}]
[441717,"E",417,17,null,{"$f":"'COG-M'!P853","v":0}]
[441800,"E",418,{"v":0,"d":"00"},"Transferencias internas otorgadas a instituciones paraestatales públicas financieras",{"$f":"'COG-M'!P854","v":0}]
[441900,"E",419,{"v":0,"d":"00"},"Transferencias internas otorgadas a fideicomisos públicos financieros",{"$f":"'COG-M'!P855","v":0}]
[420000,"E",4200,{"v":0,"d":"00"},"TRANSFERENCIAS AL RESTO DEL SECTOR PÚBLICO",{"$f":"'COG-M'!P856","v":0}]
[442111,"E",421,11,"Transferencias otorgadas a entidades paraestatales no empresariales y no financieras",{"$f":"'COG-M'!P857","v":0}]
[442114,"E",421,14,null,{"$f":"'COG-M'!P858","v":0}]
[442115,"E",421,15,null,{"$f":"'COG-M'!P859","v":0}]
[442116,"E",421,16,null,{"$f":"'COG-M'!P860","v":0}]
[442117,"E",421,17,null,{"$f":"'COG-M'!P861","v":0}]
[442200,"E",422,{"v":0,"d":"00"},"Transferencias otorgadas para entidades paraestatales empresariales y no financieras",{"$f":"'COG-M'!P862","v":0}]
[442300,"E",423,{"v":0,"d":"00"},"Transferencias otorgadas para instituciones paraestatales públicas financieras  ",{"$f":"'COG-M'!P863","v":0}]
[442400,"E",424,{"v":0,"d":"00"},"Transferencias otorgadas a entidades federativas y municipios",{"$f":"'COG-M'!P864","v":0}]
[442500,"E",425,{"v":0,"d":"00"},"Transferencias a fideicomisos de entidades federativas y municipios",{"$f":"'COG-M'!P865","v":0}]
[430000,"E",4300,{"v":0,"d":"00"},"SUBSIDIOS Y SUBVENCIONES",{"$f":"'COG-M'!P866","v":0}]
[443111,"E",431,11,"Subsidios a la producción",{"$f":"'COG-M'!P867","v":0}]
[443114,"E",431,14,null,{"$f":"'COG-M'!P868","v":0}]
[443115,"E",431,15,null,{"$f":"'COG-M'!P869","v":0}]
[443116,"E",431,16,null,{"$f":"'COG-M'!P870","v":0}]
[443117,"E",431,17,null,{"$f":"'COG-M'!P871","v":0}]
[443125,"E",431,25,null,{"$f":"'COG-M'!P872","v":0}]
[443126,"E",431,26,null,{"$f":"'COG-M'!P873","v":0}]
[443127,"E",431,27,null,{"$f":"'COG-M'!P874","v":0}]
[443211,"E",432,11,"Subsidios a la distribución",{"$f":"'COG-M'!P875","v":0}]
[443214,"E",432,14,null,{"$f":"'COG-M'!P876","v":0}]
[443215,"E",432,15,null,{"$f":"'COG-M'!P877","v":0}]
[443216,"E",432,16,null,{"$f":"'COG-M'!P878","v":0}]
[443217,"E",432,17,null,{"$f":"'COG-M'!P879","v":0}]
[443225,"E",432,25,null,{"$f":"'COG-M'!P880","v":0}]
[443226,"E",432,26,null,{"$f":"'COG-M'!P881","v":0}]
[443227,"E",432,27,null,{"$f":"'COG-M'!P882","v":0}]
[443311,"E",433,11,"Subsidios a la inversión",{"$f":"'COG-M'!P883","v":0}]
[443314,"E",433,14,null,{"$f":"'COG-M'!P884","v":0}]
[443315,"E",433,15,null,{"$f":"'COG-M'!P885","v":0}]
[443316,"E",433,16,null,{"$f":"'COG-M'!P886","v":0}]
[443317,"E",433,17,null,{"$f":"'COG-M'!P887","v":0}]
[443325,"E",433,25,null,{"$f":"'COG-M'!P888","v":0}]
[443326,"E",433,26,null,{"$f":"'COG-M'!P889","v":0}]
[443327,"E",433,27,null,{"$f":"'COG-M'!P890","v":0}]
[443411,"E",434,11,"Subsidios a la prestación de servicios públicos",{"$f":"'COG-M'!P891","v":0}]
[443414,"E",434,14,null,{"$f":"'COG-M'!P892","v":0}]
[443415,"E",434,15,null,{"$f":"'COG-M'!P893","v":0}]
[443416,"E",434,16,null,{"$f":"'COG-M'!P894","v":0}]
[443417,"E",434,17,null,{"$f":"'COG-M'!P895","v":0}]
[443425,"E",434,25,null,{"$f":"'COG-M'!P896","v":0}]
[443426,"E",434,26,null,{"$f":"'COG-M'!P897","v":0}]
[443427,"E",434,27,null,{"$f":"'COG-M'!P898","v":0}]
[443511,"E",435,11,"Subsidios para cubrir diferenciales de tasas de interés",{"$f":"'COG-M'!P899","v":0}]
[443514,"E",435,14,null,{"$f":"'COG-M'!P900","v":0}]
[443515,"E",435,15,null,{"$f":"'COG-M'!P901","v":0}]
[443516,"E",435,16,null,{"$f":"'COG-M'!P902","v":0}]
[443517,"E",435,17,null,{"$f":"'COG-M'!P903","v":0}]
[443525,"E",435,25,null,{"$f":"'COG-M'!P904","v":0}]
[443526,"E",435,26,null,{"$f":"'COG-M'!P905","v":0}]
[443527,"E",435,27,null,{"$f":"'COG-M'!P906","v":0}]
[443611,"E",436,11,"Subsidios a la vivienda ",{"$f":"'COG-M'!P907","v":0}]
[443614,"E",436,14,null,{"$f":"'COG-M'!P908","v":0}]
[443615,"E",436,15,null,{"$f":"'COG-M'!P909","v":0}]
[443616,"E",436,16,null,{"$f":"'COG-M'!P910","v":0}]
[443617,"E",436,17,null,{"$f":"'COG-M'!P911","v":0}]
[443625,"E",436,25,null,{"$f":"'COG-M'!P912","v":0}]
[443626,"E",436,26,null,{"$f":"'COG-M'!P913","v":0}]
[443627,"E",436,27,null,{"$f":"'COG-M'!P914","v":0}]
[443711,"E",437,11,"Subvenciones al consumo",{"$f":"'COG-M'!P915","v":0}]
[443714,"E",437,14,null,{"$f":"'COG-M'!P916","v":0}]
[443715,"E",437,15,null,{"$f":"'COG-M'!P917","v":0}]
[443716,"E",437,16,null,{"$f":"'COG-M'!P918","v":0}]
[443717,"E",437,17,null,{"$f":"'COG-M'!P919","v":0}]
[443725,"E",437,25,null,{"$f":"'COG-M'!P920","v":0}]
[443726,"E",437,26,null,{"$f":"'COG-M'!P921","v":0}]
[443727,"E",437,27,null,{"$f":"'COG-M'!P922","v":0}]
[443800,"E",438,{"v":0,"d":"00"},"Subsidios a entidades federativas y municipios",{"$f":"'COG-M'!P923","v":0}]
[443911,"E",439,11,"Otros subsidios",{"$f":"'COG-M'!P924","v":0}]
[443914,"E",439,14,null,{"$f":"'COG-M'!P925","v":0}]
[443915,"E",439,15,null,{"$f":"'COG-M'!P926","v":0}]
[443916,"E",439,16,null,{"$f":"'COG-M'!P927","v":0}]
[443917,"E",439,17,null,{"$f":"'COG-M'!P928","v":0}]
[443925,"E",439,25,null,{"$f":"'COG-M'!P929","v":0}]
[443926,"E",439,26,null,{"$f":"'COG-M'!P930","v":0}]
[443927,"E",439,27,null,{"$f":"'COG-M'!P931","v":0}]
[440000,"E",4400,{"v":0,"d":"00"},"AYUDAS SOCIALES",{"$f":"'COG-M'!P932","v":{"v":69816,"d":"69,816"}}]
[444111,"E",441,11,"Ayudas sociales a personas ",{"$f":"'COG-M'!P933","v":{"v":69816,"d":"69,816"}}]
[444114,"E",441,14,null,{"$f":"'COG-M'!P934","v":0}]
[444115,"E",441,15,null,{"$f":"'COG-M'!P935","v":0}]
[444116,"E",441,16,null,{"$f":"'COG-M'!P936","v":0}]
[444117,"E",441,17,null,{"$f":"'COG-M'!P937","v":0}]
[444125,"E",441,25,null,{"$f":"'COG-M'!P938","v":0}]
[444126,"E",441,26,null,{"$f":"'COG-M'!P939","v":0}]
[444127,"E",441,27,null,{"$f":"'COG-M'!P940","v":0}]
[444211,"E",442,11,"Becas y otras ayudas para programas de capacitación",{"$f":"'COG-M'!P941","v":0}]
[444214,"E",442,14,null,{"$f":"'COG-M'!P942","v":0}]
[444215,"E",442,15,null,{"$f":"'COG-M'!P943","v":0}]
[444216,"E",442,16,null,{"$f":"'COG-M'!P944","v":0}]
[444217,"E",442,17,null,{"$f":"'COG-M'!P945","v":0}]
[444225,"E",442,25,null,{"$f":"'COG-M'!P946","v":0}]
[444226,"E",442,26,null,{"$f":"'COG-M'!P947","v":0}]
[444227,"E",442,27,null,{"$f":"'COG-M'!P948","v":0}]
[444311,"E",443,11,"Ayudas sociales a instituciones de enseñanza",{"$f":"'COG-M'!P949","v":0}]
[444314,"E",443,14,null,{"$f":"'COG-M'!P950","v":0}]
[444315,"E",443,15,null,{"$f":"'COG-M'!P951","v":0}]
[444316,"E",443,16,null,{"$f":"'COG-M'!P952","v":0}]
[444317,"E",443,17,null,{"$f":"'COG-M'!P953","v":0}]
[444325,"E",443,25,null,{"$f":"'COG-M'!P954","v":0}]
[444326,"E",443,26,null,{"$f":"'COG-M'!P955","v":0}]
[444327,"E",443,27,null,{"$f":"'COG-M'!P956","v":0}]
[444411,"E",444,11,"Ayudas sociales a actividades científicas o académicas",{"$f":"'COG-M'!P957","v":0}]
[444414,"E",444,14,null,{"$f":"'COG-M'!P958","v":0}]
[444415,"E",444,15,null,{"$f":"'COG-M'!P959","v":0}]
[444416,"E",444,16,null,{"$f":"'COG-M'!P960","v":0}]
[444417,"E",444,17,null,{"$f":"'COG-M'!P961","v":0}]
[444425,"E",444,25,null,{"$f":"'COG-M'!P962","v":0}]
[444426,"E",444,26,null,{"$f":"'COG-M'!P963","v":0}]
[444427,"E",444,27,null,{"$f":"'COG-M'!P964","v":0}]
[444511,"E",445,11,"Ayudas sociales a instituciones sin fines de lucro",{"$f":"'COG-M'!P965","v":0}]
[444514,"E",445,14,null,{"$f":"'COG-M'!P966","v":0}]
[444515,"E",445,15,null,{"$f":"'COG-M'!P967","v":0}]
[444516,"E",445,16,null,{"$f":"'COG-M'!P968","v":0}]
[444517,"E",445,17,null,{"$f":"'COG-M'!P969","v":0}]
[444525,"E",445,25,null,{"$f":"'COG-M'!P970","v":0}]
[444526,"E",445,26,null,{"$f":"'COG-M'!P971","v":0}]
[444527,"E",445,27,null,{"$f":"'COG-M'!P972","v":0}]
[444611,"E",446,11,"Ayudas sociales a cooperativas",{"$f":"'COG-M'!P973","v":0}]
[444614,"E",446,14,null,{"$f":"'COG-M'!P974","v":0}]
[444615,"E",446,15,null,{"$f":"'COG-M'!P975","v":0}]
[444616,"E",446,16,null,{"$f":"'COG-M'!P976","v":0}]
[444617,"E",446,17,null,{"$f":"'COG-M'!P977","v":0}]
[444625,"E",446,25,null,{"$f":"'COG-M'!P978","v":0}]
[444626,"E",446,26,null,{"$f":"'COG-M'!P979","v":0}]
[444627,"E",446,27,null,{"$f":"'COG-M'!P980","v":0}]
[444711,"E",447,11,"Ayudas sociales a entidades de interés público",{"$f":"'COG-M'!P981","v":0}]
[444714,"E",447,14,null,{"$f":"'COG-M'!P982","v":0}]
[444715,"E",447,15,null,{"$f":"'COG-M'!P983","v":0}]
[444716,"E",447,16,null,{"$f":"'COG-M'!P984","v":0}]
[444717,"E",447,17,null,{"$f":"'COG-M'!P985","v":0}]
[444725,"E",447,25,null,{"$f":"'COG-M'!P986","v":0}]
[444726,"E",447,26,null,{"$f":"'COG-M'!P987","v":0}]
[444727,"E",447,27,null,{"$f":"'COG-M'!P988","v":0}]
[444811,"E",448,11,"Ayudas por desastres naturales y otros siniestros",{"$f":"'COG-M'!P989","v":0}]
[444814,"E",448,14,null,{"$f":"'COG-M'!P990","v":0}]
[444815,"E",448,15,null,{"$f":"'COG-M'!P991","v":0}]
[444816,"E",448,16,null,{"$f":"'COG-M'!P992","v":0}]
[444817,"E",448,17,null,{"$f":"'COG-M'!P993","v":0}]
[444825,"E",448,25,null,{"$f":"'COG-M'!P994","v":0}]
[444826,"E",448,26,null,{"$f":"'COG-M'!P995","v":0}]
[444827,"E",448,27,null,{"$f":"'COG-M'!P996","v":0}]
[450000,"E",4500,{"v":0,"d":"00"},"PENSIONES Y JUBILACIONES",{"$f":"'COG-M'!P997","v":0}]
[445111,"E",451,11,"Pensiones",{"$f":"'COG-M'!P998","v":0}]
[445114,"E",451,14,null,{"$f":"'COG-M'!P999","v":0}]
[445115,"E",451,15,null,{"$f":"'COG-M'!P1000","v":0}]
[445116,"E",451,16,null,{"$f":"'COG-M'!P1001","v":0}]
[445117,"E",451,17,null,{"$f":"'COG-M'!P1002","v":0}]
[445211,"E",452,11,"Jubilaciones",{"$f":"'COG-M'!P1003","v":0}]
[445214,"E",452,14,null,{"$f":"'COG-M'!P1004","v":0}]
[445215,"E",452,15,null,{"$f":"'COG-M'!P1005","v":0}]
[445216,"E",452,16,null,{"$f":"'COG-M'!P1006","v":0}]
[445217,"E",452,17,null,{"$f":"'COG-M'!P1007","v":0}]
[445911,"E",459,11,"Otras pensiones y jubilaciones",{"$f":"'COG-M'!P1008","v":0}]
[445914,"E",459,14,null,{"$f":"'COG-M'!P1009","v":0}]
[445915,"E",459,15,null,{"$f":"'COG-M'!P1010","v":0}]
[445916,"E",459,16,null,{"$f":"'COG-M'!P1011","v":0}]
[445917,"E",459,17,null,{"$f":"'COG-M'!P1012","v":0}]
[460000,"E",4600,{"v":0,"d":"00"},"TRANSFERENCIAS A FIDEICOMISOS, MANDATOS Y OTROS ANÁLOGOS",{"$f":"'COG-M'!P1013","v":0}]
[446111,"E",461,11,"Transferencias a fideicomisos del Poder Ejecutivo",{"$f":"'COG-M'!P1014","v":0}]
[446114,"E",461,14,null,{"$f":"'COG-M'!P1015","v":0}]
[446115,"E",461,15,null,{"$f":"'COG-M'!P1016","v":0}]
[446116,"E",461,16,null,{"$f":"'COG-M'!P1017","v":0}]
[446117,"E",461,17,null,{"$f":"'COG-M'!P1018","v":0}]
[446200,"E",462,{"v":0,"d":"00"},"Transferencias a fideicomisos del Poder Legislativo",{"$f":"'COG-M'!P1019","v":0}]
[446300,"E",463,{"v":0,"d":"00"},"Transferencias a fideicomisos del Poder Judicial",{"$f":"'COG-M'!P1020","v":0}]
[446411,"E",464,11,"Trasferencias a fideicomisos públicos de entidades paraestatales no empresariales y no financieras",{"$f":"'COG-M'!P1021","v":0}]
[446414,"E",464,14,null,{"$f":"'COG-M'!P1022","v":0}]
[446415,"E",464,15,null,{"$f":"'COG-M'!P1023","v":0}]
[446416,"E",464,16,null,{"$f":"'COG-M'!P1024","v":0}]
[446417,"E",464,17,null,{"$f":"'COG-M'!P1025","v":0}]
[446500,"E",465,{"v":0,"d":"00"},"Transferencias a fideicomisos públicos de entidades paraestatales empresariales y no financieras",{"$f":"'COG-M'!P1026","v":0}]
[446600,"E",466,{"v":0,"d":"00"},"Transferencias a fideicomisos de instituciones públicas financieras",{"$f":"'COG-M'!P1027","v":0}]
[446911,"E",469,11,"Otras transferencias a fideicomisos   ",{"$f":"'COG-M'!P1028","v":0}]
[446914,"E",469,14,null,{"$f":"'COG-M'!P1029","v":0}]
[446915,"E",469,15,null,{"$f":"'COG-M'!P1030","v":0}]
[446916,"E",469,16,null,{"$f":"'COG-M'!P1031","v":0}]
[446917,"E",469,17,null,{"$f":"'COG-M'!P1032","v":0}]
[470000,"E",4700,{"v":0,"d":"00"},"TRANSFERENCIAS A LA SEGURIDAD SOCIAL",{"$f":"'COG-M'!P1033","v":0}]
[447111,"E",471,11,"Transferencias por obligación de ley",{"$f":"'COG-M'!P1034","v":0}]
[447114,"E",471,14,null,{"$f":"'COG-M'!P1035","v":0}]
[447115,"E",471,15,null,{"$f":"'COG-M'!P1036","v":0}]
[447116,"E",471,16,null,{"$f":"'COG-M'!P1037","v":0}]
[447117,"E",471,17,null,{"$f":"'COG-M'!P1038","v":0}]
[480000,"E",4800,{"v":0,"d":"00"},"DONATIVOS",{"$f":"'COG-M'!P1039","v":0}]
[448111,"E",481,11,"Donativos a instituciones sin fines de lucro",{"$f":"'COG-M'!P1040","v":0}]
[448114,"E",481,14,null,{"$f":"'COG-M'!P1041","v":0}]
[448115,"E",481,15,null,{"$f":"'COG-M'!P1042","v":0}]
[448116,"E",481,16,null,{"$f":"'COG-M'!P1043","v":0}]
[448117,"E",481,17,null,{"$f":"'COG-M'!P1044","v":0}]
[448211,"E",482,11,"Donativos a entidades federativas ",{"$f":"'COG-M'!P1045","v":0}]
[448214,"E",482,14,null,{"$f":"'COG-M'!P1046","v":0}]
[448215,"E",482,15,null,{"$f":"'COG-M'!P1047","v":0}]
[448216,"E",482,16,null,{"$f":"'COG-M'!P1048","v":0}]
[448217,"E",482,17,null,{"$f":"'COG-M'!P1049","v":0}]
[448311,"E",483,11,"Donativos a fideicomisos privados",{"$f":"'COG-M'!P1050","v":0}]
[448314,"E",483,14,null,{"$f":"'COG-M'!P1051","v":0}]
[448315,"E",483,15,null,{"$f":"'COG-M'!P1052","v":0}]
[448316,"E",483,16,null,{"$f":"'COG-M'!P1053","v":0}]
[448317,"E",483,17,null,{"$f":"'COG-M'!P1054","v":0}]
[448411,"E",484,11,"Donativos a fideicomisos estatales",{"$f":"'COG-M'!P1055","v":0}]
[448414,"E",484,14,null,{"$f":"'COG-M'!P1056","v":0}]
[448415,"E",484,15,null,{"$f":"'COG-M'!P1057","v":0}]
[448416,"E",484,16,null,{"$f":"'COG-M'!P1058","v":0}]
[448417,"E",484,17,null,{"$f":"'COG-M'!P1059","v":0}]
[448511,"E",485,11,"Donativos internacionales",{"$f":"'COG-M'!P1060","v":0}]
[448514,"E",485,14,null,{"$f":"'COG-M'!P1061","v":0}]
[448515,"E",485,15,null,{"$f":"'COG-M'!P1062","v":0}]
[448516,"E",485,16,null,{"$f":"'COG-M'!P1063","v":0}]
[448517,"E",485,17,null,{"$f":"'COG-M'!P1064","v":0}]
[490000,"E",4900,{"v":0,"d":"00"},"TRANSFERENCIAS AL EXTERIOR",{"$f":"'COG-M'!P1065","v":0}]
[449111,"E",491,11,"Transferencias para gobiernos extranjeros",{"$f":"'COG-M'!P1066","v":0}]
[449114,"E",491,14,null,{"$f":"'COG-M'!P1067","v":0}]
[449115,"E",491,15,null,{"$f":"'COG-M'!P1068","v":0}]
[449116,"E",491,16,null,{"$f":"'COG-M'!P1069","v":0}]
[449117,"E",491,17,null,{"$f":"'COG-M'!P1070","v":0}]
[449211,"E",492,11,"Transferencias para organismos internacionales",{"$f":"'COG-M'!P1071","v":0}]
[449214,"E",492,14,null,{"$f":"'COG-M'!P1072","v":0}]
[449215,"E",492,15,null,{"$f":"'COG-M'!P1073","v":0}]
[449216,"E",492,16,null,{"$f":"'COG-M'!P1074","v":0}]
[449217,"E",492,17,null,{"$f":"'COG-M'!P1075","v":0}]
[449311,"E",493,11,"Transferencias para el sector privado externo",{"$f":"'COG-M'!P1076","v":0}]
[449314,"E",493,14,null,{"$f":"'COG-M'!P1077","v":0}]
[449315,"E",493,15,null,{"$f":"'COG-M'!P1078","v":0}]
[449316,"E",493,16,null,{"$f":"'COG-M'!P1079","v":0}]
[449317,"E",493,17,null,{"$f":"'COG-M'!P1080","v":0}]
[500000,"E",5000,{"v":0,"d":"00"},"BIENES MUEBLES, INMUEBLES E INTANGIBLES ",{"$f":"'COG-M'!P1081","v":{"v":19416,"d":"19,416"}}]
[510000,"E",5100,{"v":0,"d":"00"},"MOBILIARIO Y EQUIPO DE ADMINISTRACIÓN",{"$f":"'COG-M'!P1082","v":{"v":19416,"d":"19,416"}}]
[551111,"E",511,11,"Muebles de oficina y estantería ",{"$f":"'COG-M'!P1083","v":0}]
[551112,"E",511,12,null,{"$f":"'COG-M'!P1084","v":0}]
[551114,"E",511,14,null,{"$f":"'COG-M'!P1085","v":0}]
[551115,"E",511,15,null,{"$f":"'COG-M'!P1086","v":0}]
[551116,"E",511,16,null,{"$f":"'COG-M'!P1087","v":0}]
[551117,"E",511,17,null,{"$f":"'COG-M'!P1088","v":0}]
[551125,"E",511,25,null,{"$f":"'COG-M'!P1089","v":0}]
[551126,"E",511,26,null,{"$f":"'COG-M'!P1090","v":0}]
[551127,"E",511,27,null,{"$f":"'COG-M'!P1091","v":0}]
[551211,"E",512,11,"Muebles, excepto de oficina y estantería",{"$f":"'COG-M'!P1092","v":0}]
[551212,"E",512,12,null,{"$f":"'COG-M'!P1093","v":0}]
[551214,"E",512,14,null,{"$f":"'COG-M'!P1094","v":0}]
[551215,"E",512,15,null,{"$f":"'COG-M'!P1095","v":0}]
[551216,"E",512,16,null,{"$f":"'COG-M'!P1096","v":0}]
[551217,"E",512,17,null,{"$f":"'COG-M'!P1097","v":0}]
[551225,"E",512,25,null,{"$f":"'COG-M'!P1098","v":0}]
[551226,"E",512,26,null,{"$f":"'COG-M'!P1099","v":0}]
[551227,"E",512,27,null,{"$f":"'COG-M'!P1100","v":0}]
[551311,"E",513,11,"Bienes artísticos, culturales y científicos",{"$f":"'COG-M'!P1101","v":0}]
[551312,"E",513,12,null,{"$f":"'COG-M'!P1102","v":0}]
[551314,"E",513,14,null,{"$f":"'COG-M'!P1103","v":0}]
[551315,"E",513,15,null,{"$f":"'COG-M'!P1104","v":0}]
[551316,"E",513,16,null,{"$f":"'COG-M'!P1105","v":0}]
[551317,"E",513,17,null,{"$f":"'COG-M'!P1106","v":0}]
[551325,"E",513,25,null,{"$f":"'COG-M'!P1107","v":0}]
[551326,"E",513,26,null,{"$f":"'COG-M'!P1108","v":0}]
[551327,"E",513,27,null,{"$f":"'COG-M'!P1109","v":0}]
[551411,"E",514,11,"Objetos de valor",{"$f":"'COG-M'!P1110","v":0}]
[551412,"E",514,12,null,{"$f":"'COG-M'!P1111","v":0}]
[551414,"E",514,14,null,{"$f":"'COG-M'!P1112","v":0}]
[551415,"E",514,15,null,{"$f":"'COG-M'!P1113","v":0}]
[551416,"E",514,16,null,{"$f":"'COG-M'!P1114","v":0}]
[551417,"E",514,17,null,{"$f":"'COG-M'!P1115","v":0}]
[551425,"E",514,25,null,{"$f":"'COG-M'!P1116","v":0}]
[551426,"E",514,26,null,{"$f":"'COG-M'!P1117","v":0}]
[551427,"E",514,27,null,{"$f":"'COG-M'!P1118","v":0}]
[551511,"E",515,11,"Equipo de cómputo de tecnologías de la información",{"$f":"'COG-M'!P1119","v":{"v":19416,"d":"19,416"}}]
[551512,"E",515,12,null,{"$f":"'COG-M'!P1120","v":0}]
[551514,"E",515,14,null,{"$f":"'COG-M'!P1121","v":0}]
[551515,"E",515,15,null,{"$f":"'COG-M'!P1122","v":0}]
[551516,"E",515,16,null,{"$f":"'COG-M'!P1123","v":0}]
[551517,"E",515,17,null,{"$f":"'COG-M'!P1124","v":0}]
[551525,"E",515,25,null,{"$f":"'COG-M'!P1125","v":0}]
[551526,"E",515,26,null,{"$f":"'COG-M'!P1126","v":0}]
[551527,"E",515,27,null,{"$f":"'COG-M'!P1127","v":0}]
[551911,"E",519,11,"Otros mobiliarios y equipos de administración",{"$f":"'COG-M'!P1128","v":0}]
[551912,"E",519,12,null,{"$f":"'COG-M'!P1129","v":0}]
[551914,"E",519,14,null,{"$f":"'COG-M'!P1130","v":0}]
[551915,"E",519,15,null,{"$f":"'COG-M'!P1131","v":0}]
[551916,"E",519,16,null,{"$f":"'COG-M'!P1132","v":0}]
[551917,"E",519,17,null,{"$f":"'COG-M'!P1133","v":0}]
[551925,"E",519,25,null,{"$f":"'COG-M'!P1134","v":0}]
[551926,"E",519,26,null,{"$f":"'COG-M'!P1135","v":0}]
[551927,"E",519,27,null,{"$f":"'COG-M'!P1136","v":0}]
[520000,"E",5200,{"v":0,"d":"00"},"MOBILIARIO Y EQUIPO EDUCACIONAL Y RECREATIVO",{"$f":"'COG-M'!P1137","v":0}]
[552111,"E",521,11,"Equipos y aparatos audiovisuales",{"$f":"'COG-M'!P1138","v":0}]
[552112,"E",521,12,null,{"$f":"'COG-M'!P1139","v":0}]
[552114,"E",521,14,null,{"$f":"'COG-M'!P1140","v":0}]
[552115,"E",521,15,null,{"$f":"'COG-M'!P1141","v":0}]
[552116,"E",521,16,null,{"$f":"'COG-M'!P1142","v":0}]
[552117,"E",521,17,null,{"$f":"'COG-M'!P1143","v":0}]
[552125,"E",521,25,null,{"$f":"'COG-M'!P1144","v":0}]
[552126,"E",521,26,null,{"$f":"'COG-M'!P1145","v":0}]
[552127,"E",521,27,null,{"$f":"'COG-M'!P1146","v":0}]
[552211,"E",522,11,"Aparatos deportivos",{"$f":"'COG-M'!P1147","v":0}]
[552212,"E",522,12,null,{"$f":"'COG-M'!P1148","v":0}]
[552214,"E",522,14,null,{"$f":"'COG-M'!P1149","v":0}]
[552215,"E",522,15,null,{"$f":"'COG-M'!P1150","v":0}]
[552216,"E",522,16,null,{"$f":"'COG-M'!P1151","v":0}]
[552217,"E",522,17,null,{"$f":"'COG-M'!P1152","v":0}]
[552225,"E",522,25,null,{"$f":"'COG-M'!P1153","v":0}]
[552226,"E",522,26,null,{"$f":"'COG-M'!P1154","v":0}]
[552227,"E",522,27,null,{"$f":"'COG-M'!P1155","v":0}]
[552311,"E",523,11,"Cámaras fotográficas y de video",{"$f":"'COG-M'!P1156","v":0}]
[552312,"E",523,12,null,{"$f":"'COG-M'!P1157","v":0}]
[552315,"E",523,15,null,{"$f":"'COG-M'!P1158","v":0}]
[552316,"E",523,16,null,{"$f":"'COG-M'!P1159","v":0}]
[552317,"E",523,17,null,{"$f":"'COG-M'!P1160","v":0}]
[552325,"E",523,25,null,{"$f":"'COG-M'!P1161","v":0}]
[552326,"E",523,26,null,{"$f":"'COG-M'!P1162","v":0}]
[552327,"E",523,27,null,{"$f":"'COG-M'!P1163","v":0}]
[552911,"E",529,11,"Otro mobiliario y equipo educacional y recreativo ",{"$f":"'COG-M'!P1164","v":0}]
[552912,"E",529,12,null,{"$f":"'COG-M'!P1165","v":0}]
[552914,"E",529,14,null,{"$f":"'COG-M'!P1166","v":0}]
[552915,"E",529,15,null,{"$f":"'COG-M'!P1167","v":0}]
[552916,"E",529,16,null,{"$f":"'COG-M'!P1168","v":0}]
[552917,"E",529,17,null,{"$f":"'COG-M'!P1169","v":0}]
[552925,"E",529,25,null,{"$f":"'COG-M'!P1170","v":0}]
[552926,"E",529,26,null,{"$f":"'COG-M'!P1171","v":0}]
[552927,"E",529,27,null,{"$f":"'COG-M'!P1172","v":0}]
[530000,"E",5300,{"v":0,"d":"00"},"EQUIPO E INSTRUMENTAL MÉDICO Y DE LABORATORIO",{"$f":"'COG-M'!P1173","v":0}]
[553111,"E",531,11,"Equipo médico y de laboratorio",{"$f":"'COG-M'!P1174","v":0}]
[553112,"E",531,12,null,{"$f":"'COG-M'!P1175","v":0}]
[553114,"E",531,14,null,{"$f":"'COG-M'!P1176","v":0}]
[553115,"E",531,15,null,{"$f":"'COG-M'!P1177","v":0}]
[553116,"E",531,16,null,{"$f":"'COG-M'!P1178","v":0}]
[553117,"E",531,17,null,{"$f":"'COG-M'!P1179","v":0}]
[553125,"E",531,25,null,{"$f":"'COG-M'!P1180","v":0}]
[553126,"E",531,26,null,{"$f":"'COG-M'!P1181","v":0}]
[553127,"E",531,27,null,{"$f":"'COG-M'!P1182","v":0}]
[553211,"E",532,11,"Instrumental médico y de laboratorio",{"$f":"'COG-M'!P1183","v":0}]
[553212,"E",532,12,null,{"$f":"'COG-M'!P1184","v":0}]
[553214,"E",532,14,null,{"$f":"'COG-M'!P1185","v":0}]
[553215,"E",532,15,null,{"$f":"'COG-M'!P1186","v":0}]
[553216,"E",532,16,null,{"$f":"'COG-M'!P1187","v":0}]
[553217,"E",532,17,null,{"$f":"'COG-M'!P1188","v":0}]
[553225,"E",532,25,null,{"$f":"'COG-M'!P1189","v":0}]
[553226,"E",532,26,null,{"$f":"'COG-M'!P1190","v":0}]
[553227,"E",532,27,null,{"$f":"'COG-M'!P1191","v":0}]
[540000,"E",5400,{"v":0,"d":"00"},"VEHÍCULOS Y EQUIPO DE TRANSPORTE",{"$f":"'COG-M'!P1192","v":0}]
[554111,"E",541,11,"Vehículos y equipo terrestre",{"$f":"'COG-M'!P1193","v":0}]
[554112,"E",541,12,null,{"$f":"'COG-M'!P1194","v":0}]
[554114,"E",541,14,null,{"$f":"'COG-M'!P1195","v":0}]
[554115,"E",541,15,null,{"$f":"'COG-M'!P1196","v":0}]
[554116,"E",541,16,null,{"$f":"'COG-M'!P1197","v":0}]
[554117,"E",541,17,null,{"$f":"'COG-M'!P1198","v":0}]
[554125,"E",541,25,null,{"$f":"'COG-M'!P1199","v":0}]
[554126,"E",541,26,null,{"$f":"'COG-M'!P1200","v":0}]
[554127,"E",541,27,null,{"$f":"'COG-M'!P1201","v":0}]
[554211,"E",542,11,"Carrocerías  y remolques",{"$f":"'COG-M'!P1202","v":0}]
[554212,"E",542,12,null,{"$f":"'COG-M'!P1203","v":0}]
[554214,"E",542,14,null,{"$f":"'COG-M'!P1204","v":0}]
[554215,"E",542,15,null,{"$f":"'COG-M'!P1205","v":0}]
[554216,"E",542,16,null,{"$f":"'COG-M'!P1206","v":0}]
[554217,"E",542,17,null,{"$f":"'COG-M'!P1207","v":0}]
[554225,"E",542,25,null,{"$f":"'COG-M'!P1208","v":0}]
[554226,"E",542,26,null,{"$f":"'COG-M'!P1209","v":0}]
[554227,"E",542,27,null,{"$f":"'COG-M'!P1210","v":0}]
[554311,"E",543,11,"Equipo aeroespacial",{"$f":"'COG-M'!P1211","v":0}]
[554312,"E",543,12,null,{"$f":"'COG-M'!P1212","v":0}]
[554314,"E",543,14,null,{"$f":"'COG-M'!P1213","v":0}]
[554315,"E",543,15,null,{"$f":"'COG-M'!P1214","v":0}]
[554316,"E",543,16,null,{"$f":"'COG-M'!P1215","v":0}]
[554317,"E",543,17,null,{"$f":"'COG-M'!P1216","v":0}]
[554325,"E",543,25,null,{"$f":"'COG-M'!P1217","v":0}]
[554326,"E",543,26,null,{"$f":"'COG-M'!P1218","v":0}]
[554327,"E",543,27,null,{"$f":"'COG-M'!P1219","v":0}]
[554411,"E",544,11,"Equipo ferroviario",{"$f":"'COG-M'!P1220","v":0}]
[554412,"E",544,12,null,{"$f":"'COG-M'!P1221","v":0}]
[554414,"E",544,14,null,{"$f":"'COG-M'!P1222","v":0}]
[554415,"E",544,15,null,{"$f":"'COG-M'!P1223","v":0}]
[554416,"E",544,16,null,{"$f":"'COG-M'!P1224","v":0}]
[554417,"E",544,17,null,{"$f":"'COG-M'!P1225","v":0}]
[554425,"E",544,25,null,{"$f":"'COG-M'!P1226","v":0}]
[554426,"E",544,26,null,{"$f":"'COG-M'!P1227","v":0}]
[554427,"E",544,27,null,{"$f":"'COG-M'!P1228","v":0}]
[554511,"E",545,11,"Embarcaciones",{"$f":"'COG-M'!P1229","v":0}]
[554512,"E",545,12,null,{"$f":"'COG-M'!P1230","v":0}]
[554514,"E",545,14,null,{"$f":"'COG-M'!P1231","v":0}]
[554515,"E",545,15,null,{"$f":"'COG-M'!P1232","v":0}]
[554516,"E",545,16,null,{"$f":"'COG-M'!P1233","v":0}]
[554517,"E",545,17,null,{"$f":"'COG-M'!P1234","v":0}]
[554525,"E",545,25,null,{"$f":"'COG-M'!P1235","v":0}]
[554526,"E",545,26,null,{"$f":"'COG-M'!P1236","v":0}]
[554527,"E",545,27,null,{"$f":"'COG-M'!P1237","v":0}]
[554911,"E",549,11,"Otros equipo de transporte",{"$f":"'COG-M'!P1238","v":0}]
[554912,"E",549,12,null,{"$f":"'COG-M'!P1239","v":0}]
[554914,"E",549,14,null,{"$f":"'COG-M'!P1240","v":0}]
[554915,"E",549,15,null,{"$f":"'COG-M'!P1241","v":0}]
[554916,"E",549,16,null,{"$f":"'COG-M'!P1242","v":0}]
[554917,"E",549,17,null,{"$f":"'COG-M'!P1243","v":0}]
[554925,"E",549,25,null,{"$f":"'COG-M'!P1244","v":0}]
[554926,"E",549,26,null,{"$f":"'COG-M'!P1245","v":0}]
[554927,"E",549,27,null,{"$f":"'COG-M'!P1246","v":0}]
[550000,"E",5500,{"v":0,"d":"00"},"EQUIPO DE DEFENSA Y SEGURIDAD",{"$f":"'COG-M'!P1247","v":0}]
[555111,"E",551,11,"Equipo de defensa y seguridad",{"$f":"'COG-M'!P1248","v":0}]
[555112,"E",551,12,null,{"$f":"'COG-M'!P1249","v":0}]
[555114,"E",551,14,null,{"$f":"'COG-M'!P1250","v":0}]
[555115,"E",551,15,null,{"$f":"'COG-M'!P1251","v":0}]
[555116,"E",551,16,null,{"$f":"'COG-M'!P1252","v":0}]
[555117,"E",551,17,null,{"$f":"'COG-M'!P1253","v":0}]
[555125,"E",551,25,null,{"$f":"'COG-M'!P1254","v":0}]
[555126,"E",551,26,null,{"$f":"'COG-M'!P1255","v":0}]
[555127,"E",551,27,null,{"$f":"'COG-M'!P1256","v":0}]
[560000,"E",5600,{"v":0,"d":"00"},"MAQUINARIA, OTROS EQUIPOS Y HERRAMIENTAS",{"$f":"'COG-M'!P1257","v":0}]
[556111,"E",561,11,"Maquinaria y equipo agropecuario",{"$f":"'COG-M'!P1258","v":0}]
[556112,"E",561,12,null,{"$f":"'COG-M'!P1259","v":0}]
[556114,"E",561,14,null,{"$f":"'COG-M'!P1260","v":0}]
[556115,"E",561,15,null,{"$f":"'COG-M'!P1261","v":0}]
[556116,"E",561,16,null,{"$f":"'COG-M'!P1262","v":0}]
[556117,"E",561,17,null,{"$f":"'COG-M'!P1263","v":0}]
[556125,"E",561,25,null,{"$f":"'COG-M'!P1264","v":0}]
[556126,"E",561,26,null,{"$f":"'COG-M'!P1265","v":0}]
[556127,"E",561,27,null,{"$f":"'COG-M'!P1266","v":0}]
[556211,"E",562,11,"Maquinaria y equipo industrial",{"$f":"'COG-M'!P1267","v":0}]
[556212,"E",562,12,null,{"$f":"'COG-M'!P1268","v":0}]
[556214,"E",562,14,null,{"$f":"'COG-M'!P1269","v":0}]
[556215,"E",562,15,null,{"$f":"'COG-M'!P1270","v":0}]
[556216,"E",562,16,null,{"$f":"'COG-M'!P1271","v":0}]
[556217,"E",562,17,null,{"$f":"'COG-M'!P1272","v":0}]
[556225,"E",562,25,null,{"$f":"'COG-M'!P1273","v":0}]
[556226,"E",562,26,null,{"$f":"'COG-M'!P1274","v":0}]
[556227,"E",562,27,null,{"$f":"'COG-M'!P1275","v":0}]
[556311,"E",563,11,"Maquinaria y equipo de construcción",{"$f":"'COG-M'!P1276","v":0}]
[556312,"E",563,12,null,{"$f":"'COG-M'!P1277","v":0}]
[556314,"E",563,14,null,{"$f":"'COG-M'!P1278","v":0}]
[556315,"E",563,15,null,{"$f":"'COG-M'!P1279","v":0}]
[556316,"E",563,16,null,{"$f":"'COG-M'!P1280","v":0}]
[556317,"E",563,17,null,{"$f":"'COG-M'!P1281","v":0}]
[556325,"E",563,25,null,{"$f":"'COG-M'!P1282","v":0}]
[556326,"E",563,26,null,{"$f":"'COG-M'!P1283","v":0}]
[556327,"E",563,27,null,{"$f":"'COG-M'!P1284","v":0}]
[556411,"E",564,11,"Sistemas de aire acondicionado, calefacción y de refrigeración industrial y comercial",{"$f":"'COG-M'!P1285","v":0}]
[556412,"E",564,12,null,{"$f":"'COG-M'!P1286","v":0}]
[556414,"E",564,14,null,{"$f":"'COG-M'!P1287","v":0}]
[556415,"E",564,15,null,{"$f":"'COG-M'!P1288","v":0}]
[556416,"E",564,16,null,{"$f":"'COG-M'!P1289","v":0}]
[556417,"E",564,17,null,{"$f":"'COG-M'!P1290","v":0}]
[556425,"E",564,25,null,{"$f":"'COG-M'!P1291","v":0}]
[556426,"E",564,26,null,{"$f":"'COG-M'!P1292","v":0}]
[556427,"E",564,27,null,{"$f":"'COG-M'!P1293","v":0}]
[556511,"E",565,11,"Equipo de comunicación y telecomunicación",{"$f":"'COG-M'!P1294","v":0}]
[556512,"E",565,12,null,{"$f":"'COG-M'!P1295","v":0}]
[556514,"E",565,14,null,{"$f":"'COG-M'!P1296","v":0}]
[556515,"E",565,15,null,{"$f":"'COG-M'!P1297","v":0}]
[556516,"E",565,16,null,{"$f":"'COG-M'!P1298","v":0}]
[556517,"E",565,17,null,{"$f":"'COG-M'!P1299","v":0}]
[556525,"E",565,25,null,{"$f":"'COG-M'!P1300","v":0}]
[556526,"E",565,26,null,{"$f":"'COG-M'!P1301","v":0}]
[556527,"E",565,27,null,{"$f":"'COG-M'!P1302","v":0}]
[556611,"E",566,11,"Equipo de generación eléctrica, aparatos y accesorios eléctricos",{"$f":"'COG-M'!P1303","v":0}]
[556612,"E",566,12,null,{"$f":"'COG-M'!P1304","v":0}]
[556614,"E",566,14,null,{"$f":"'COG-M'!P1305","v":0}]
[556615,"E",566,15,null,{"$f":"'COG-M'!P1306","v":0}]
[556616,"E",566,16,null,{"$f":"'COG-M'!P1307","v":0}]
[556617,"E",566,17,null,{"$f":"'COG-M'!P1308","v":0}]
[556625,"E",566,25,null,{"$f":"'COG-M'!P1309","v":0}]
[556626,"E",566,26,null,{"$f":"'COG-M'!P1310","v":0}]
[556627,"E",566,27,null,{"$f":"'COG-M'!P1311","v":0}]
[556711,"E",567,11,"Herramientas y máquinas-herramienta",{"$f":"'COG-M'!P1312","v":0}]
[556712,"E",567,12,null,{"$f":"'COG-M'!P1313","v":0}]
[556714,"E",567,14,null,{"$f":"'COG-M'!P1314","v":0}]
[556715,"E",567,15,null,{"$f":"'COG-M'!P1315","v":0}]
[556716,"E",567,16,null,{"$f":"'COG-M'!P1316","v":0}]
[556717,"E",567,17,null,{"$f":"'COG-M'!P1317","v":0}]
[556725,"E",567,25,null,{"$f":"'COG-M'!P1318","v":0}]
[556726,"E",567,26,null,{"$f":"'COG-M'!P1319","v":0}]
[556727,"E",567,27,null,{"$f":"'COG-M'!P1320","v":0}]
[556911,"E",569,11,"Otros equipos",{"$f":"'COG-M'!P1321","v":0}]
[556912,"E",569,12,null,{"$f":"'COG-M'!P1322","v":0}]
[556914,"E",569,14,null,{"$f":"'COG-M'!P1323","v":0}]
[556915,"E",569,15,null,{"$f":"'COG-M'!P1324","v":0}]
[556916,"E",569,16,null,{"$f":"'COG-M'!P1325","v":0}]
[556917,"E",569,17,null,{"$f":"'COG-M'!P1326","v":0}]
[556925,"E",569,25,null,{"$f":"'COG-M'!P1327","v":0}]
[556926,"E",569,26,null,{"$f":"'COG-M'!P1328","v":0}]
[556927,"E",569,27,null,{"$f":"'COG-M'!P1329","v":0}]
[570000,"E",5700,{"v":0,"d":"00"},"ACTIVOS BIOLÓGICOS",{"$f":"'COG-M'!P1330","v":0}]
[557111,"E",571,11,"Bovinos",{"$f":"'COG-M'!P1331","v":0}]
[557112,"E",571,12,null,{"$f":"'COG-M'!P1332","v":0}]
[557114,"E",571,14,null,{"$f":"'COG-M'!P1333","v":0}]
[557115,"E",571,15,null,{"$f":"'COG-M'!P1334","v":0}]
[557116,"E",571,16,null,{"$f":"'COG-M'!P1335","v":0}]
[557117,"E",571,17,null,{"$f":"'COG-M'!P1336","v":0}]
[557125,"E",571,25,null,{"$f":"'COG-M'!P1337","v":0}]
[557126,"E",571,26,null,{"$f":"'COG-M'!P1338","v":0}]
[557127,"E",571,27,null,{"$f":"'COG-M'!P1339","v":0}]
[557211,"E",572,11,"Porcinos",{"$f":"'COG-M'!P1340","v":0}]
[557212,"E",572,12,null,{"$f":"'COG-M'!P1341","v":0}]
[557214,"E",572,14,null,{"$f":"'COG-M'!P1342","v":0}]
[557215,"E",572,15,null,{"$f":"'COG-M'!P1343","v":0}]
[557216,"E",572,16,null,{"$f":"'COG-M'!P1344","v":0}]
[557217,"E",572,17,null,{"$f":"'COG-M'!P1345","v":0}]
[557225,"E",572,25,null,{"$f":"'COG-M'!P1346","v":0}]
[557226,"E",572,26,null,{"$f":"'COG-M'!P1347","v":0}]
[557227,"E",572,27,null,{"$f":"'COG-M'!P1348","v":0}]
[557311,"E",573,11,"Aves",{"$f":"'COG-M'!P1349","v":0}]
[557312,"E",573,12,null,{"$f":"'COG-M'!P1350","v":0}]
[557314,"E",573,14,null,{"$f":"'COG-M'!P1351","v":0}]
[557315,"E",573,15,null,{"$f":"'COG-M'!P1352","v":0}]
[557316,"E",573,16,null,{"$f":"'COG-M'!P1353","v":0}]
[557317,"E",573,17,null,{"$f":"'COG-M'!P1354","v":0}]
[557325,"E",573,25,null,{"$f":"'COG-M'!P1355","v":0}]
[557326,"E",573,26,null,{"$f":"'COG-M'!P1356","v":0}]
[557327,"E",573,27,null,{"$f":"'COG-M'!P1357","v":0}]
[557411,"E",574,11,"Ovinos y caprinos ",{"$f":"'COG-M'!P1358","v":0}]
[557412,"E",574,12,null,{"$f":"'COG-M'!P1359","v":0}]
[557414,"E",574,14,null,{"$f":"'COG-M'!P1360","v":0}]
[557415,"E",574,15,null,{"$f":"'COG-M'!P1361","v":0}]
[557416,"E",574,16,null,{"$f":"'COG-M'!P1362","v":0}]
[557417,"E",574,17,null,{"$f":"'COG-M'!P1363","v":0}]
[557425,"E",574,25,null,{"$f":"'COG-M'!P1364","v":0}]
[557426,"E",574,26,null,{"$f":"'COG-M'!P1365","v":0}]
[557427,"E",574,27,null,{"$f":"'COG-M'!P1366","v":0}]
[557511,"E",575,11,"Peces y acuicultura",{"$f":"'COG-M'!P1367","v":0}]
[557512,"E",575,12,null,{"$f":"'COG-M'!P1368","v":0}]
[557514,"E",575,14,null,{"$f":"'COG-M'!P1369","v":0}]
[557515,"E",575,15,null,{"$f":"'COG-M'!P1370","v":0}]
[557516,"E",575,16,null,{"$f":"'COG-M'!P1371","v":0}]
[557517,"E",575,17,null,{"$f":"'COG-M'!P1372","v":0}]
[557525,"E",575,25,null,{"$f":"'COG-M'!P1373","v":0}]
[557526,"E",575,26,null,{"$f":"'COG-M'!P1374","v":0}]
[557527,"E",575,27,null,{"$f":"'COG-M'!P1375","v":0}]
[557611,"E",576,11,"Equinos",{"$f":"'COG-M'!P1376","v":0}]
[557612,"E",576,12,null,{"$f":"'COG-M'!P1377","v":0}]
[557614,"E",576,14,null,{"$f":"'COG-M'!P1378","v":0}]
[557615,"E",576,15,null,{"$f":"'COG-M'!P1379","v":0}]
[557616,"E",576,16,null,{"$f":"'COG-M'!P1380","v":0}]
[557617,"E",576,17,null,{"$f":"'COG-M'!P1381","v":0}]
[557625,"E",576,25,null,{"$f":"'COG-M'!P1382","v":0}]
[557626,"E",576,26,null,{"$f":"'COG-M'!P1383","v":0}]
[557627,"E",576,27,null,{"$f":"'COG-M'!P1384","v":0}]
[557711,"E",577,11,"Especies menores y de zoológico",{"$f":"'COG-M'!P1385","v":0}]
[557712,"E",577,12,null,{"$f":"'COG-M'!P1386","v":0}]
[557714,"E",577,14,null,{"$f":"'COG-M'!P1387","v":0}]
[557715,"E",577,15,null,{"$f":"'COG-M'!P1388","v":0}]
[557716,"E",577,16,null,{"$f":"'COG-M'!P1389","v":0}]
[557717,"E",577,17,null,{"$f":"'COG-M'!P1390","v":0}]
[557725,"E",577,25,null,{"$f":"'COG-M'!P1391","v":0}]
[557726,"E",577,26,null,{"$f":"'COG-M'!P1392","v":0}]
[557727,"E",577,27,null,{"$f":"'COG-M'!P1393","v":0}]
[557811,"E",578,11,"Árboles y plantas",{"$f":"'COG-M'!P1394","v":0}]
[557812,"E",578,12,null,{"$f":"'COG-M'!P1395","v":0}]
[557814,"E",578,14,null,{"$f":"'COG-M'!P1396","v":0}]
[557815,"E",578,15,null,{"$f":"'COG-M'!P1397","v":0}]
[557816,"E",578,16,null,{"$f":"'COG-M'!P1398","v":0}]
[557817,"E",578,17,null,{"$f":"'COG-M'!P1399","v":0}]
[557825,"E",578,25,null,{"$f":"'COG-M'!P1400","v":0}]
[557826,"E",578,26,null,{"$f":"'COG-M'!P1401","v":0}]
[557827,"E",578,27,null,{"$f":"'COG-M'!P1402","v":0}]
[557911,"E",579,11,"Otros activos biológicos",{"$f":"'COG-M'!P1403","v":0}]
[557912,"E",579,12,null,{"$f":"'COG-M'!P1404","v":0}]
[557914,"E",579,14,null,{"$f":"'COG-M'!P1405","v":0}]
[557915,"E",579,15,null,{"$f":"'COG-M'!P1406","v":0}]
[557916,"E",579,16,null,{"$f":"'COG-M'!P1407","v":0}]
[557917,"E",579,17,null,{"$f":"'COG-M'!P1408","v":0}]
[557925,"E",579,25,null,{"$f":"'COG-M'!P1409","v":0}]
[557926,"E",579,26,null,{"$f":"'COG-M'!P1410","v":0}]
[557927,"E",579,27,null,{"$f":"'COG-M'!P1411","v":0}]
[580000,"E",5800,{"v":0,"d":"00"},"BIENES INMUEBLES",{"$f":"'COG-M'!P1412","v":0}]
[558111,"E",581,11,"Terrenos",{"$f":"'COG-M'!P1413","v":0}]
[558112,"E",581,12,null,{"$f":"'COG-M'!P1414","v":0}]
[558114,"E",581,14,null,{"$f":"'COG-M'!P1415","v":0}]
[558115,"E",581,15,null,{"$f":"'COG-M'!P1416","v":0}]
[558116,"E",581,16,null,{"$f":"'COG-M'!P1417","v":0}]
[558117,"E",581,17,null,{"$f":"'COG-M'!P1418","v":0}]
[558125,"E",581,25,null,{"$f":"'COG-M'!P1419","v":0}]
[558126,"E",581,26,null,{"$f":"'COG-M'!P1420","v":0}]
[558127,"E",581,27,null,{"$f":"'COG-M'!P1421","v":0}]
[558211,"E",582,11,"Viviendas ",{"$f":"'COG-M'!P1422","v":0}]
[558212,"E",582,12,null,{"$f":"'COG-M'!P1423","v":0}]
[558214,"E",582,14,null,{"$f":"'COG-M'!P1424","v":0}]
[558215,"E",582,15,null,{"$f":"'COG-M'!P1425","v":0}]
[558216,"E",582,16,null,{"$f":"'COG-M'!P1426","v":0}]
[558217,"E",582,17,null,{"$f":"'COG-M'!P1427","v":0}]
[558225,"E",582,25,null,{"$f":"'COG-M'!P1428","v":0}]
[558226,"E",582,26,null,{"$f":"'COG-M'!P1429","v":0}]
[558227,"E",582,27,null,{"$f":"'COG-M'!P1430","v":0}]
[558311,"E",583,11,"Edificios no residenciales",{"$f":"'COG-M'!P1431","v":0}]
[558312,"E",583,12,null,{"$f":"'COG-M'!P1432","v":0}]
[558314,"E",583,14,null,{"$f":"'COG-M'!P1433","v":0}]
[558315,"E",583,15,null,{"$f":"'COG-M'!P1434","v":0}]
[558316,"E",583,16,null,{"$f":"'COG-M'!P1435","v":0}]
[558317,"E",583,17,null,{"$f":"'COG-M'!P1436","v":0}]
[558325,"E",583,25,null,{"$f":"'COG-M'!P1437","v":0}]
[558326,"E",583,26,null,{"$f":"'COG-M'!P1438","v":0}]
[558327,"E",583,27,null,{"$f":"'COG-M'!P1439","v":0}]
[558911,"E",589,11,"Otros bienes inmuebles",{"$f":"'COG-M'!P1440","v":0}]
[558912,"E",589,12,null,{"$f":"'COG-M'!P1441","v":0}]
[558914,"E",589,14,null,{"$f":"'COG-M'!P1442","v":0}]
[558915,"E",589,15,null,{"$f":"'COG-M'!P1443","v":0}]
[558916,"E",589,16,null,{"$f":"'COG-M'!P1444","v":0}]
[558917,"E",589,17,null,{"$f":"'COG-M'!P1445","v":0}]
[558925,"E",589,25,null,{"$f":"'COG-M'!P1446","v":0}]
[558926,"E",589,26,null,{"$f":"'COG-M'!P1447","v":0}]
[558927,"E",589,27,null,{"$f":"'COG-M'!P1448","v":0}]
[590000,"E",5900,{"v":0,"d":"00"},"ACTIVOS INTANGIBLES",{"$f":"'COG-M'!P1449","v":0}]
[559111,"E",591,11,"Software",{"$f":"'COG-M'!P1450","v":0}]
[559112,"E",591,12,null,{"$f":"'COG-M'!P1451","v":0}]
[559114,"E",591,14,null,{"$f":"'COG-M'!P1452","v":0}]
[559115,"E",591,15,null,{"$f":"'COG-M'!P1453","v":0}]
[559116,"E",591,16,null,{"$f":"'COG-M'!P1454","v":0}]
[559117,"E",591,17,null,{"$f":"'COG-M'!P1455","v":0}]
[559125,"E",591,25,null,{"$f":"'COG-M'!P1456","v":0}]
[559126,"E",591,26,null,{"$f":"'COG-M'!P1457","v":0}]
[559127,"E",591,27,null,{"$f":"'COG-M'!P1458","v":0}]
[559211,"E",592,11,"Patentes",{"$f":"'COG-M'!P1459","v":0}]
[559212,"E",592,12,null,{"$f":"'COG-M'!P1460","v":0}]
[559214,"E",592,14,null,{"$f":"'COG-M'!P1461","v":0}]
[559215,"E",592,15,null,{"$f":"'COG-M'!P1462","v":0}]
[559216,"E",592,16,null,{"$f":"'COG-M'!P1463","v":0}]
[559217,"E",592,17,null,{"$f":"'COG-M'!P1464","v":0}]
[559225,"E",592,25,null,{"$f":"'COG-M'!P1465","v":0}]
[559226,"E",592,26,null,{"$f":"'COG-M'!P1466","v":0}]
[559227,"E",592,27,null,{"$f":"'COG-M'!P1467","v":0}]
[559311,"E",593,11,"Marcas",{"$f":"'COG-M'!P1468","v":0}]
[559312,"E",593,12,null,{"$f":"'COG-M'!P1469","v":0}]
[559314,"E",593,14,null,{"$f":"'COG-M'!P1470","v":0}]
[559315,"E",593,15,null,{"$f":"'COG-M'!P1471","v":0}]
[559316,"E",593,16,null,{"$f":"'COG-M'!P1472","v":0}]
[559317,"E",593,17,null,{"$f":"'COG-M'!P1473","v":0}]
[559325,"E",593,25,null,{"$f":"'COG-M'!P1474","v":0}]
[559326,"E",593,26,null,{"$f":"'COG-M'!P1475","v":0}]
[559327,"E",593,27,null,{"$f":"'COG-M'!P1476","v":0}]
[559411,"E",594,11,"Derechos",{"$f":"'COG-M'!P1477","v":0}]
[559412,"E",594,12,null,{"$f":"'COG-M'!P1478","v":0}]
[559414,"E",594,14,null,{"$f":"'COG-M'!P1479","v":0}]
[559415,"E",594,15,null,{"$f":"'COG-M'!P1480","v":0}]
[559416,"E",594,16,null,{"$f":"'COG-M'!P1481","v":0}]
[559417,"E",594,17,null,{"$f":"'COG-M'!P1482","v":0}]
[559425,"E",594,25,null,{"$f":"'COG-M'!P1483","v":0}]
[559426,"E",594,26,null,{"$f":"'COG-M'!P1484","v":0}]
[559427,"E",594,27,null,{"$f":"'COG-M'!P1485","v":0}]
[559511,"E",595,11,"Concesiones",{"$f":"'COG-M'!P1486","v":0}]
[559512,"E",595,12,null,{"$f":"'COG-M'!P1487","v":0}]
[559514,"E",595,14,null,{"$f":"'COG-M'!P1488","v":0}]
[559515,"E",595,15,null,{"$f":"'COG-M'!P1489","v":0}]
[559516,"E",595,16,null,{"$f":"'COG-M'!P1490","v":0}]
[559517,"E",595,17,null,{"$f":"'COG-M'!P1491","v":0}]
[559525,"E",595,25,null,{"$f":"'COG-M'!P1492","v":0}]
[559526,"E",595,26,null,{"$f":"'COG-M'!P1493","v":0}]
[559527,"E",595,27,null,{"$f":"'COG-M'!P1494","v":0}]
[559611,"E",596,11,"Franquicias",{"$f":"'COG-M'!P1495","v":0}]
[559612,"E",596,12,null,{"$f":"'COG-M'!P1496","v":0}]
[559614,"E",596,14,null,{"$f":"'COG-M'!P1497","v":0}]
[559615,"E",596,15,null,{"$f":"'COG-M'!P1498","v":0}]
[559616,"E",596,16,null,{"$f":"'COG-M'!P1499","v":0}]
[559617,"E",596,17,null,{"$f":"'COG-M'!P1500","v":0}]
[559625,"E",596,25,null,{"$f":"'COG-M'!P1501","v":0}]
[559626,"E",596,26,null,{"$f":"'COG-M'!P1502","v":0}]
[559627,"E",596,27,null,{"$f":"'COG-M'!P1503","v":0}]
[559711,"E",597,11,"Licencias informáticas e intelectuales",{"$f":"'COG-M'!P1504","v":0}]
[559712,"E",597,12,null,{"$f":"'COG-M'!P1505","v":0}]
[559714,"E",597,14,null,{"$f":"'COG-M'!P1506","v":0}]
[559715,"E",597,15,null,{"$f":"'COG-M'!P1507","v":0}]
[559716,"E",597,16,null,{"$f":"'COG-M'!P1508","v":0}]
[559717,"E",597,17,null,{"$f":"'COG-M'!P1509","v":0}]
[559725,"E",597,25,null,{"$f":"'COG-M'!P1510","v":0}]
[559726,"E",597,26,null,{"$f":"'COG-M'!P1511","v":0}]
[559727,"E",597,27,null,{"$f":"'COG-M'!P1512","v":0}]
[559811,"E",598,11,"Licencias industriales, comerciales y otras",{"$f":"'COG-M'!P1513","v":0}]
[559812,"E",598,12,null,{"$f":"'COG-M'!P1514","v":0}]
[559814,"E",598,14,null,{"$f":"'COG-M'!P1515","v":0}]
[559815,"E",598,15,null,{"$f":"'COG-M'!P1516","v":0}]
[559816,"E",598,16,null,{"$f":"'COG-M'!P1517","v":0}]
[559817,"E",598,17,null,{"$f":"'COG-M'!P1518","v":0}]
[559825,"E",598,25,null,{"$f":"'COG-M'!P1519","v":0}]
[559826,"E",598,26,null,{"$f":"'COG-M'!P1520","v":0}]
[559827,"E",598,27,null,{"$f":"'COG-M'!P1521","v":0}]
[559911,"E",599,11,"Otros activos intangibles",{"$f":"'COG-M'!P1522","v":0}]
[559912,"E",599,12,null,{"$f":"'COG-M'!P1523","v":0}]
[559914,"E",599,14,null,{"$f":"'COG-M'!P1524","v":0}]
[559915,"E",599,15,null,{"$f":"'COG-M'!P1525","v":0}]
[559916,"E",599,16,null,{"$f":"'COG-M'!P1526","v":0}]
[559917,"E",599,17,null,{"$f":"'COG-M'!P1527","v":0}]
[559925,"E",599,25,null,{"$f":"'COG-M'!P1528","v":0}]
[559926,"E",599,26,null,{"$f":"'COG-M'!P1529","v":0}]
[559927,"E",599,27,null,{"$f":"'COG-M'!P1530","v":0}]
[600000,"E",6000,{"v":0,"d":"00"},"INVERSIÓN PÚBLICA",{"$f":"'COG-M'!P1531","v":0}]
[610000,"E",6100,{"v":0,"d":"00"},"OBRA PÚBLICA EN BIENES DE DOMINIO PÚBLICO",{"$f":"'COG-M'!P1532","v":0}]
[661111,"E",611,11,"Edificación habitacional",{"$f":"'COG-M'!P1533","v":0}]
[661112,"E",611,12,null,{"$f":"'COG-M'!P1534","v":0}]
[661114,"E",611,14,null,{"$f":"'COG-M'!P1535","v":0}]
[661115,"E",611,15,null,{"$f":"'COG-M'!P1536","v":0}]
[661116,"E",611,16,null,{"$f":"'COG-M'!P1537","v":0}]
[661117,"E",611,17,null,{"$f":"'COG-M'!P1538","v":0}]
[661125,"E",611,25,null,{"$f":"'COG-M'!P1539","v":0}]
[661126,"E",611,26,null,{"$f":"'COG-M'!P1540","v":0}]
[661127,"E",611,27,null,{"$f":"'COG-M'!P1541","v":0}]
[661211,"E",612,11,"Edificación no  habitacional",{"$f":"'COG-M'!P1542","v":0}]
[661212,"E",612,12,null,{"$f":"'COG-M'!P1543","v":0}]
[661214,"E",612,14,null,{"$f":"'COG-M'!P1544","v":0}]
[661215,"E",612,15,null,{"$f":"'COG-M'!P1545","v":0}]
[661216,"E",612,16,null,{"$f":"'COG-M'!P1546","v":0}]
[661217,"E",612,17,null,{"$f":"'COG-M'!P1547","v":0}]
[661225,"E",612,25,null,{"$f":"'COG-M'!P1548","v":0}]
[661226,"E",612,26,null,{"$f":"'COG-M'!P1549","v":0}]
[661227,"E",612,27,null,{"$f":"'COG-M'!P1550","v":0}]
[661311,"E",613,11,"Construcción de obras para el abastecimiento de agua, petróleo, gas, electricidad y telecomunicaciones",{"$f":"'COG-M'!P1551","v":0}]
[661312,"E",613,12,null,{"$f":"'COG-M'!P1552","v":0}]
[661314,"E",613,14,null,{"$f":"'COG-M'!P1553","v":0}]
[661315,"E",613,15,null,{"$f":"'COG-M'!P1554","v":0}]
[661316,"E",613,16,null,{"$f":"'COG-M'!P1555","v":0}]
[661317,"E",613,17,null,{"$f":"'COG-M'!P1556","v":0}]
[661325,"E",613,25,null,{"$f":"'COG-M'!P1557","v":0}]
[661326,"E",613,26,null,{"$f":"'COG-M'!P1558","v":0}]
[661327,"E",613,27,null,{"$f":"'COG-M'!P1559","v":0}]
[661411,"E",614,11,"División de terrenos y construcción de obras de urbanización",{"$f":"'COG-M'!P1560","v":0}]
[661412,"E",614,12,null,{"$f":"'COG-M'!P1561","v":0}]
[661414,"E",614,14,null,{"$f":"'COG-M'!P1562","v":0}]
[661415,"E",614,15,null,{"$f":"'COG-M'!P1563","v":0}]
[661416,"E",614,16,null,{"$f":"'COG-M'!P1564","v":0}]
[661417,"E",614,17,null,{"$f":"'COG-M'!P1565","v":0}]
[661425,"E",614,25,null,{"$f":"'COG-M'!P1566","v":0}]
[661426,"E",614,26,null,{"$f":"'COG-M'!P1567","v":0}]
[661427,"E",614,27,null,{"$f":"'COG-M'!P1568","v":0}]
[661511,"E",615,11,"Construcción de vías de comunicación",{"$f":"'COG-M'!P1569","v":0}]
[661512,"E",615,12,null,{"$f":"'COG-M'!P1570","v":0}]
[661514,"E",615,14,null,{"$f":"'COG-M'!P1571","v":0}]
[661515,"E",615,15,null,{"$f":"'COG-M'!P1572","v":0}]
[661516,"E",615,16,null,{"$f":"'COG-M'!P1573","v":0}]
[661517,"E",615,17,null,{"$f":"'COG-M'!P1574","v":0}]
[661525,"E",615,25,null,{"$f":"'COG-M'!P1575","v":0}]
[661526,"E",615,26,null,{"$f":"'COG-M'!P1576","v":0}]
[661527,"E",615,27,null,{"$f":"'COG-M'!P1577","v":0}]
[661611,"E",616,11,"Otras construcciones de ingeniería civil u obra pesada",{"$f":"'COG-M'!P1578","v":0}]
[661612,"E",616,12,null,{"$f":"'COG-M'!P1579","v":0}]
[661614,"E",616,14,null,{"$f":"'COG-M'!P1580","v":0}]
[661615,"E",616,15,null,{"$f":"'COG-M'!P1581","v":0}]
[661616,"E",616,16,null,{"$f":"'COG-M'!P1582","v":0}]
[661617,"E",616,17,null,{"$f":"'COG-M'!P1583","v":0}]
[661625,"E",616,25,null,{"$f":"'COG-M'!P1584","v":0}]
[661626,"E",616,26,null,{"$f":"'COG-M'!P1585","v":0}]
[661627,"E",616,27,null,{"$f":"'COG-M'!P1586","v":0}]
[661711,"E",617,11,"Instalaciones y equipamiento en construcciones",{"$f":"'COG-M'!P1587","v":0}]
[661712,"E",617,12,null,{"$f":"'COG-M'!P1588","v":0}]
[661714,"E",617,14,null,{"$f":"'COG-M'!P1589","v":0}]
[661715,"E",617,15,null,{"$f":"'COG-M'!P1590","v":0}]
[661716,"E",617,16,null,{"$f":"'COG-M'!P1591","v":0}]
[661717,"E",617,17,null,{"$f":"'COG-M'!P1592","v":0}]
[661725,"E",617,25,null,{"$f":"'COG-M'!P1593","v":0}]
[661726,"E",617,26,null,{"$f":"'COG-M'!P1594","v":0}]
[661727,"E",617,27,null,{"$f":"'COG-M'!P1595","v":0}]
[661911,"E",619,11,"Trabajo de acabados en edificaciones y otros trabajos especializados",{"$f":"'COG-M'!P1596","v":0}]
[661912,"E",619,12,null,{"$f":"'COG-M'!P1597","v":0}]
[661914,"E",619,14,null,{"$f":"'COG-M'!P1598","v":0}]
[661915,"E",619,15,null,{"$f":"'COG-M'!P1599","v":0}]
[661916,"E",619,16,null,{"$f":"'COG-M'!P1600","v":0}]
[661917,"E",619,17,null,{"$f":"'COG-M'!P1601","v":0}]
[661925,"E",619,25,null,{"$f":"'COG-M'!P1602","v":0}]
[661926,"E",619,26,null,{"$f":"'COG-M'!P1603","v":0}]
[661927,"E",619,27,null,{"$f":"'COG-M'!P1604","v":0}]
[620000,"E",6200,{"v":0,"d":"00"},"OBRA PÚBLICA EN BIENES PROPIOS",{"$f":"'COG-M'!P1605","v":0}]
[662111,"E",621,11,"Edificación habitacional",{"$f":"'COG-M'!P1606","v":0}]
[662112,"E",621,12,null,{"$f":"'COG-M'!P1607","v":0}]
[662114,"E",621,14,null,{"$f":"'COG-M'!P1608","v":0}]
[662115,"E",621,15,null,{"$f":"'COG-M'!P1609","v":0}]
[662116,"E",621,16,null,{"$f":"'COG-M'!P1610","v":0}]
[662117,"E",621,17,null,{"$f":"'COG-M'!P1611","v":0}]
[662125,"E",621,25,null,{"$f":"'COG-M'!P1612","v":0}]
[662126,"E",621,26,null,{"$f":"'COG-M'!P1613","v":0}]
[662127,"E",621,27,null,{"$f":"'COG-M'!P1614","v":0}]
[662211,"E",622,11,"Edificación no habitacional",{"$f":"'COG-M'!P1615","v":0}]
[662212,"E",622,12,null,{"$f":"'COG-M'!P1616","v":0}]
[662214,"E",622,14,null,{"$f":"'COG-M'!P1617","v":0}]
[662215,"E",622,15,null,{"$f":"'COG-M'!P1618","v":0}]
[662216,"E",622,16,null,{"$f":"'COG-M'!P1619","v":0}]
[662217,"E",622,17,null,{"$f":"'COG-M'!P1620","v":0}]
[662225,"E",622,25,null,{"$f":"'COG-M'!P1621","v":0}]
[662226,"E",622,26,null,{"$f":"'COG-M'!P1622","v":0}]
[662227,"E",622,27,null,{"$f":"'COG-M'!P1623","v":0}]
[662311,"E",623,11,"Construcción de obras para  el abastecimiento de agua,  petróleo, gas, electricidad y telecomunicaciones",{"$f":"'COG-M'!P1624","v":0}]
[662312,"E",623,12,null,{"$f":"'COG-M'!P1625","v":0}]
[662314,"E",623,14,null,{"$f":"'COG-M'!P1626","v":0}]
[662315,"E",623,15,null,{"$f":"'COG-M'!P1627","v":0}]
[662316,"E",623,16,null,{"$f":"'COG-M'!P1628","v":0}]
[662317,"E",623,17,null,{"$f":"'COG-M'!P1629","v":0}]
[662325,"E",623,25,null,{"$f":"'COG-M'!P1630","v":0}]
[662326,"E",623,26,null,{"$f":"'COG-M'!P1631","v":0}]
[662327,"E",623,27,null,{"$f":"'COG-M'!P1632","v":0}]
[662411,"E",624,11,"División de terrenos y construcción de obras de urbanización",{"$f":"'COG-M'!P1633","v":0}]
[662412,"E",624,12,null,{"$f":"'COG-M'!P1634","v":0}]
[662414,"E",624,14,null,{"$f":"'COG-M'!P1635","v":0}]
[662415,"E",624,15,null,{"$f":"'COG-M'!P1636","v":0}]
[662416,"E",624,16,null,{"$f":"'COG-M'!P1637","v":0}]
[662417,"E",624,17,null,{"$f":"'COG-M'!P1638","v":0}]
[662425,"E",624,25,null,{"$f":"'COG-M'!P1639","v":0}]
[662426,"E",624,26,null,{"$f":"'COG-M'!P1640","v":0}]
[662427,"E",624,27,null,{"$f":"'COG-M'!P1641","v":0}]
[662511,"E",625,11,"Construcción de vías de comunicación",{"$f":"'COG-M'!P1642","v":0}]
[662512,"E",625,12,null,{"$f":"'COG-M'!P1643","v":0}]
[662514,"E",625,14,null,{"$f":"'COG-M'!P1644","v":0}]
[662515,"E",625,15,null,{"$f":"'COG-M'!P1645","v":0}]
[662516,"E",625,16,null,{"$f":"'COG-M'!P1646","v":0}]
[662517,"E",625,17,null,{"$f":"'COG-M'!P1647","v":0}]
[662525,"E",625,25,null,{"$f":"'COG-M'!P1648","v":0}]
[662526,"E",625,26,null,{"$f":"'COG-M'!P1649","v":0}]
[662527,"E",625,27,null,{"$f":"'COG-M'!P1650","v":0}]
[662611,"E",626,11,"Otras construcciones de ingeniería civil u obra pesada",{"$f":"'COG-M'!P1651","v":0}]
[662612,"E",626,12,null,{"$f":"'COG-M'!P1652","v":0}]
[662614,"E",626,14,null,{"$f":"'COG-M'!P1653","v":0}]
[662615,"E",626,15,null,{"$f":"'COG-M'!P1654","v":0}]
[662616,"E",626,16,null,{"$f":"'COG-M'!P1655","v":0}]
[662617,"E",626,17,null,{"$f":"'COG-M'!P1656","v":0}]
[662625,"E",626,25,null,{"$f":"'COG-M'!P1657","v":0}]
[662626,"E",626,26,null,{"$f":"'COG-M'!P1658","v":0}]
[662627,"E",626,27,null,{"$f":"'COG-M'!P1659","v":0}]
[662711,"E",627,11,"Instalaciones y equipamiento en construcciones",{"$f":"'COG-M'!P1660","v":0}]
[662712,"E",627,12,null,{"$f":"'COG-M'!P1661","v":0}]
[662714,"E",627,14,null,{"$f":"'COG-M'!P1662","v":0}]
[662715,"E",627,15,null,{"$f":"'COG-M'!P1663","v":0}]
[662716,"E",627,16,null,{"$f":"'COG-M'!P1664","v":0}]
[662717,"E",627,17,null,{"$f":"'COG-M'!P1665","v":0}]
[662725,"E",627,25,null,{"$f":"'COG-M'!P1666","v":0}]
[662726,"E",627,26,null,{"$f":"'COG-M'!P1667","v":0}]
[662727,"E",627,27,null,{"$f":"'COG-M'!P1668","v":0}]
[662911,"E",629,11,"Trabajos de acabados en edificaciones y otros trabajos especializados",{"$f":"'COG-M'!P1669","v":0}]
[662912,"E",629,12,null,{"$f":"'COG-M'!P1670","v":0}]
[662914,"E",629,14,null,{"$f":"'COG-M'!P1671","v":0}]
[662915,"E",629,15,null,{"$f":"'COG-M'!P1672","v":0}]
[662916,"E",629,16,null,{"$f":"'COG-M'!P1673","v":0}]
[662917,"E",629,17,null,{"$f":"'COG-M'!P1674","v":0}]
[662925,"E",629,25,null,{"$f":"'COG-M'!P1675","v":0}]
[662926,"E",629,26,null,{"$f":"'COG-M'!P1676","v":0}]
[662927,"E",629,27,null,{"$f":"'COG-M'!P1677","v":0}]
[630000,"E",6300,{"v":0,"d":"00"},"PROYECTOS PRODUCTIVOS Y ACCIONES DE FOMENTO",{"$f":"'COG-M'!P1678","v":0}]
[663111,"E",631,11,"Estudios, formulación y evaluación de proyectos productivos no incluidos en conceptos anteriores de este capítulo",{"$f":"'COG-M'!P1679","v":0}]
[663112,"E",631,12,null,{"$f":"'COG-M'!P1680","v":0}]
[663114,"E",631,14,null,{"$f":"'COG-M'!P1681","v":0}]
[663115,"E",631,15,null,{"$f":"'COG-M'!P1682","v":0}]
[663116,"E",631,16,null,{"$f":"'COG-M'!P1683","v":0}]
[663117,"E",631,17,null,{"$f":"'COG-M'!P1684","v":0}]
[663125,"E",631,25,null,{"$f":"'COG-M'!P1685","v":0}]
[663126,"E",631,26,null,{"$f":"'COG-M'!P1686","v":0}]
[663127,"E",631,27,null,{"$f":"'COG-M'!P1687","v":0}]
[663211,"E",632,11,"Ejecución de proyectos productivos no incluidos en conceptos anteriores de este capítulo",{"$f":"'COG-M'!P1688","v":0}]
[663212,"E",632,12,null,{"$f":"'COG-M'!P1689","v":0}]
[663214,"E",632,14,null,{"$f":"'COG-M'!P1690","v":0}]
[663215,"E",632,15,null,{"$f":"'COG-M'!P1691","v":0}]
[663216,"E",632,16,null,{"$f":"'COG-M'!P1692","v":0}]
[663217,"E",632,17,null,{"$f":"'COG-M'!P1693","v":0}]
[663225,"E",632,25,null,{"$f":"'COG-M'!P1694","v":0}]
[663226,"E",632,26,null,{"$f":"'COG-M'!P1695","v":0}]
[663227,"E",632,27,null,{"$f":"'COG-M'!P1696","v":0}]
[700000,"E",7000,{"v":0,"d":"00"},"INVERSIONES FINANCIERAS Y OTRAS PROVISIONES",{"$f":"'COG-M'!P1697","v":0}]
[710000,"E",7100,{"v":0,"d":"00"},"INVERSIONES PARA EL FOMENTO DE ACTIVIDADES PRODUCTIVAS",{"$f":"'COG-M'!P1698","v":0}]
[771111,"E",711,11,"Créditos otorgados por entidades federativas y municipios al sector social y privado para el fomento de actividades productivas",{"$f":"'COG-M'!P1699","v":0}]
[771112,"E",711,12,null,{"$f":"'COG-M'!P1700","v":0}]
[771114,"E",711,14,null,{"$f":"'COG-M'!P1701","v":0}]
[771115,"E",711,15,null,{"$f":"'COG-M'!P1702","v":0}]
[771116,"E",711,16,null,{"$f":"'COG-M'!P1703","v":0}]
[771117,"E",711,17,null,{"$f":"'COG-M'!P1704","v":0}]
[771125,"E",711,25,null,{"$f":"'COG-M'!P1705","v":0}]
[771126,"E",711,26,null,{"$f":"'COG-M'!P1706","v":0}]
[771127,"E",711,27,null,{"$f":"'COG-M'!P1707","v":0}]
[771200,"E",712,{"v":0,"d":"00"},"Créditos otorgados por las entidades federativas a municipios para el fomento de actividades productivas",{"$f":"'COG-M'!P1708","v":0}]
[720000,"E",7200,{"v":0,"d":"00"},"ACCIONES Y PARTICIPACIONES DE CAPITAL",{"$f":"'COG-M'!P1709","v":0}]
[772111,"E",721,11,"Acciones y participaciones de capital en entidades paraestatales no empresariales y no financieras con fines de política económica",{"$f":"'COG-M'!P1710","v":0}]
[772112,"E",721,12,null,{"$f":"'COG-M'!P1711","v":0}]
[772114,"E",721,14,null,{"$f":"'COG-M'!P1712","v":0}]
[772115,"E",721,15,null,{"$f":"'COG-M'!P1713","v":0}]
[772116,"E",721,16,null,{"$f":"'COG-M'!P1714","v":0}]
[772117,"E",721,17,null,{"$f":"'COG-M'!P1715","v":0}]
[772125,"E",721,25,null,{"$f":"'COG-M'!P1716","v":0}]
[772126,"E",721,26,null,{"$f":"'COG-M'!P1717","v":0}]
[772127,"E",721,27,null,{"$f":"'COG-M'!P1718","v":0}]
[772200,"E",722,{"v":0,"d":"00"},"Acciones y participaciones de capital en entidades paraestatales empresariales y no financieras con fines de política económica",{"$f":"'COG-M'!P1719","v":0}]
[772300,"E",723,{"v":0,"d":"00"},"Acciones  y participaciones de capital en instituciones paraestatales públicas financieras con fines de política económica",{"$f":"'COG-M'!P1720","v":0}]
[772411,"E",724,11,"Acciones y participaciones  de capital en el sector privado con fines de política económica",{"$f":"'COG-M'!P1721","v":0}]
[772412,"E",724,12,null,{"$f":"'COG-M'!P1722","v":0}]
[772414,"E",724,14,null,{"$f":"'COG-M'!P1723","v":0}]
[772415,"E",724,15,null,{"$f":"'COG-M'!P1724","v":0}]
[772416,"E",724,16,null,{"$f":"'COG-M'!P1725","v":0}]
[772417,"E",724,17,null,{"$f":"'COG-M'!P1726","v":0}]
[772425,"E",724,25,null,{"$f":"'COG-M'!P1727","v":0}]
[772426,"E",724,26,null,{"$f":"'COG-M'!P1728","v":0}]
[772427,"E",724,27,null,{"$f":"'COG-M'!P1729","v":0}]
[772511,"E",725,11,"Acciones y participaciones de capital en organismos internacionales con fines de política económica",{"$f":"'COG-M'!P1730","v":0}]
[772512,"E",725,12,null,{"$f":"'COG-M'!P1731","v":0}]
[772514,"E",725,14,null,{"$f":"'COG-M'!P1732","v":0}]
[772515,"E",725,15,null,{"$f":"'COG-M'!P1733","v":0}]
[772516,"E",725,16,null,{"$f":"'COG-M'!P1734","v":0}]
[772517,"E",725,17,null,{"$f":"'COG-M'!P1735","v":0}]
[772525,"E",725,25,null,{"$f":"'COG-M'!P1736","v":0}]
[772526,"E",725,26,null,{"$f":"'COG-M'!P1737","v":0}]
[772527,"E",725,27,null,{"$f":"'COG-M'!P1738","v":0}]
[772611,"E",726,11,"Acciones y participaciones de capital en el sector externo con fines de política económica",{"$f":"'COG-M'!P1739","v":0}]
[772612,"E",726,12,null,{"$f":"'COG-M'!P1740","v":0}]
[772614,"E",726,14,null,{"$f":"'COG-M'!P1741","v":0}]
[772615,"E",726,15,null,{"$f":"'COG-M'!P1742","v":0}]
[772616,"E",726,16,null,{"$f":"'COG-M'!P1743","v":0}]
[772617,"E",726,17,null,{"$f":"'COG-M'!P1744","v":0}]
[772625,"E",726,25,null,{"$f":"'COG-M'!P1745","v":0}]
[772626,"E",726,26,null,{"$f":"'COG-M'!P1746","v":0}]
[772627,"E",726,27,null,{"$f":"'COG-M'!P1747","v":0}]
[772711,"E",727,11,"Acciones y participaciones de capital en el sector público con fines de gestión de la liquidez",{"$f":"'COG-M'!P1748","v":0}]
[772712,"E",727,12,null,{"$f":"'COG-M'!P1749","v":0}]
[772714,"E",727,14,null,{"$f":"'COG-M'!P1750","v":0}]
[772715,"E",727,15,null,{"$f":"'COG-M'!P1751","v":0}]
[772716,"E",727,16,null,{"$f":"'COG-M'!P1752","v":0}]
[772717,"E",727,17,null,{"$f":"'COG-M'!P1753","v":0}]
[772725,"E",727,25,null,{"$f":"'COG-M'!P1754","v":0}]
[772726,"E",727,26,null,{"$f":"'COG-M'!P1755","v":0}]
[772727,"E",727,27,null,{"$f":"'COG-M'!P1756","v":0}]
[772811,"E",728,11,"Acciones y participaciones de capital  en el sector privado con fines de gestión de liquidez",{"$f":"'COG-M'!P1757","v":0}]
[772812,"E",728,12,null,{"$f":"'COG-M'!P1758","v":0}]
[772814,"E",728,14,null,{"$f":"'COG-M'!P1759","v":0}]
[772815,"E",728,15,null,{"$f":"'COG-M'!P1760","v":0}]
[772816,"E",728,16,null,{"$f":"'COG-M'!P1761","v":0}]
[772817,"E",728,17,null,{"$f":"'COG-M'!P1762","v":0}]
[772825,"E",728,25,null,{"$f":"'COG-M'!P1763","v":0}]
[772826,"E",728,26,null,{"$f":"'COG-M'!P1764","v":0}]
[772827,"E",728,27,null,{"$f":"'COG-M'!P1765","v":0}]
[772911,"E",729,11,"Acciones y participaciones de capital en el sector externo con fines de gestión  de liquidez",{"$f":"'COG-M'!P1766","v":0}]
[772912,"E",729,12,null,{"$f":"'COG-M'!P1767","v":0}]
[772914,"E",729,14,null,{"$f":"'COG-M'!P1768","v":0}]
[772915,"E",729,15,null,{"$f":"'COG-M'!P1769","v":0}]
[772916,"E",729,16,null,{"$f":"'COG-M'!P1770","v":0}]
[772917,"E",729,17,null,{"$f":"'COG-M'!P1771","v":0}]
[772925,"E",729,25,null,{"$f":"'COG-M'!P1772","v":0}]
[772926,"E",729,26,null,{"$f":"'COG-M'!P1773","v":0}]
[772927,"E",729,27,null,{"$f":"'COG-M'!P1774","v":0}]
[730000,"E",7300,{"v":0,"d":"00"},"COMPRA DE TÍTULOS Y VALORES",{"$f":"'COG-M'!P1775","v":0}]
[773111,"E",731,11,"Bonos",{"$f":"'COG-M'!P1776","v":0}]
[773114,"E",731,14,null,{"$f":"'COG-M'!P1777","v":0}]
[773115,"E",731,15,null,{"$f":"'COG-M'!P1778","v":0}]
[773116,"E",731,16,null,{"$f":"'COG-M'!P1779","v":0}]
[773117,"E",731,17,null,{"$f":"'COG-M'!P1780","v":0}]
[773125,"E",731,25,null,{"$f":"'COG-M'!P1781","v":0}]
[773126,"E",731,26,null,{"$f":"'COG-M'!P1782","v":0}]
[773127,"E",731,27,null,{"$f":"'COG-M'!P1783","v":0}]
[773211,"E",732,11,"Valores representativos de deuda adquiridos con fines de política económica",{"$f":"'COG-M'!P1784","v":0}]
[773214,"E",732,14,null,{"$f":"'COG-M'!P1785","v":0}]
[773215,"E",732,15,null,{"$f":"'COG-M'!P1786","v":0}]
[773216,"E",732,16,null,{"$f":"'COG-M'!P1787","v":0}]
[773217,"E",732,17,null,{"$f":"'COG-M'!P1788","v":0}]
[773225,"E",732,25,null,{"$f":"'COG-M'!P1789","v":0}]
[773226,"E",732,26,null,{"$f":"'COG-M'!P1790","v":0}]
[773227,"E",732,27,null,{"$f":"'COG-M'!P1791","v":0}]
[773311,"E",733,11,"Valores representativos de deuda  adquiridos con fines de gestión de liquidez",{"$f":"'COG-M'!P1792","v":0}]
[773314,"E",733,14,null,{"$f":"'COG-M'!P1793","v":0}]
[773315,"E",733,15,null,{"$f":"'COG-M'!P1794","v":0}]
[773316,"E",733,16,null,{"$f":"'COG-M'!P1795","v":0}]
[773317,"E",733,17,null,{"$f":"'COG-M'!P1796","v":0}]
[773325,"E",733,25,null,{"$f":"'COG-M'!P1797","v":0}]
[773326,"E",733,26,null,{"$f":"'COG-M'!P1798","v":0}]
[773327,"E",733,27,null,{"$f":"'COG-M'!P1799","v":0}]
[773411,"E",734,11,"Obligaciones negociables adquiridas con fines de política económica",{"$f":"'COG-M'!P1800","v":0}]
[773414,"E",734,14,null,{"$f":"'COG-M'!P1801","v":0}]
[773415,"E",734,15,null,{"$f":"'COG-M'!P1802","v":0}]
[773416,"E",734,16,null,{"$f":"'COG-M'!P1803","v":0}]
[773417,"E",734,17,null,{"$f":"'COG-M'!P1804","v":0}]
[773425,"E",734,25,null,{"$f":"'COG-M'!P1805","v":0}]
[773426,"E",734,26,null,{"$f":"'COG-M'!P1806","v":0}]
[773427,"E",734,27,null,{"$f":"'COG-M'!P1807","v":0}]
[773511,"E",735,11,"Obligaciones negociables adquiridas con fines de gestión de liquidez",{"$f":"'COG-M'!P1808","v":0}]
[773514,"E",735,14,null,{"$f":"'COG-M'!P1809","v":0}]
[773515,"E",735,15,null,{"$f":"'COG-M'!P1810","v":0}]
[773516,"E",735,16,null,{"$f":"'COG-M'!P1811","v":0}]
[773517,"E",735,17,null,{"$f":"'COG-M'!P1812","v":0}]
[773525,"E",735,25,null,{"$f":"'COG-M'!P1813","v":0}]
[773526,"E",735,26,null,{"$f":"'COG-M'!P1814","v":0}]
[773527,"E",735,27,null,{"$f":"'COG-M'!P1815","v":0}]
[773911,"E",739,11,"Otros valores",{"$f":"'COG-M'!P1816","v":0}]
[773914,"E",739,14,null,{"$f":"'COG-M'!P1817","v":0}]
[773915,"E",739,15,null,{"$f":"'COG-M'!P1818","v":0}]
[773916,"E",739,16,null,{"$f":"'COG-M'!P1819","v":0}]
[773917,"E",739,17,null,{"$f":"'COG-M'!P1820","v":0}]
[773925,"E",739,25,null,{"$f":"'COG-M'!P1821","v":0}]
[773926,"E",739,26,null,{"$f":"'COG-M'!P1822","v":0}]
[773927,"E",739,27,null,{"$f":"'COG-M'!P1823","v":0}]
[740000,"E",7400,{"v":0,"d":"00"},"CONCESIÓN DE PRÉSTAMOS",{"$f":"'COG-M'!P1824","v":0}]
[774111,"E",741,11,"Concesión de préstamos a entidades paraestatales no empresariales y no financieras con fines de política económica",{"$f":"'COG-M'!P1825","v":0}]
[774114,"E",741,14,null,{"$f":"'COG-M'!P1826","v":0}]
[774115,"E",741,15,null,{"$f":"'COG-M'!P1827","v":0}]
[774116,"E",741,16,null,{"$f":"'COG-M'!P1828","v":0}]
[774117,"E",741,17,null,{"$f":"'COG-M'!P1829","v":0}]
[774125,"E",741,25,null,{"$f":"'COG-M'!P1830","v":0}]
[774126,"E",741,26,null,{"$f":"'COG-M'!P1831","v":0}]
[774127,"E",741,27,null,{"$f":"'COG-M'!P1832","v":0}]
[774200,"E",742,{"v":0,"d":"00"},"Concesión de préstamos a entidades paraestatales empresariales y no financieras con fines de política económica",{"$f":"'COG-M'!P1833","v":0}]
[774300,"E",743,{"v":0,"d":"00"},"Concesión de préstamos a instituciones paraestatales públicas financieras con fines de política económica",{"$f":"'COG-M'!P1834","v":0}]
[774400,"E",744,{"v":0,"d":"00"},"Concesión de préstamos a entidades federativas  y municipios con fines de política económica",{"$f":"'COG-M'!P1835","v":0}]
[774511,"E",745,11,"Concesión de préstamos al sector privado con fines de política económica",{"$f":"'COG-M'!P1836","v":0}]
[774514,"E",745,14,null,{"$f":"'COG-M'!P1837","v":0}]
[774515,"E",745,15,null,{"$f":"'COG-M'!P1838","v":0}]
[774516,"E",745,16,null,{"$f":"'COG-M'!P1839","v":0}]
[774517,"E",745,17,null,{"$f":"'COG-M'!P1840","v":0}]
[774525,"E",745,25,null,{"$f":"'COG-M'!P1841","v":0}]
[774526,"E",745,26,null,{"$f":"'COG-M'!P1842","v":0}]
[774527,"E",745,27,null,{"$f":"'COG-M'!P1843","v":0}]
[774611,"E",746,11,"Concesión de préstamos al sector externo con fines de política económica",{"$f":"'COG-M'!P1844","v":0}]
[774614,"E",746,14,null,{"$f":"'COG-M'!P1845","v":0}]
[774615,"E",746,15,null,{"$f":"'COG-M'!P1846","v":0}]
[774616,"E",746,16,null,{"$f":"'COG-M'!P1847","v":0}]
[774617,"E",746,17,null,{"$f":"'COG-M'!P1848","v":0}]
[774625,"E",746,25,null,{"$f":"'COG-M'!P1849","v":0}]
[774626,"E",746,26,null,{"$f":"'COG-M'!P1850","v":0}]
[774627,"E",746,27,null,{"$f":"'COG-M'!P1851","v":0}]
[774711,"E",747,11,"Concesión de préstamos al sector público con fines de gestión de liquidez",{"$f":"'COG-M'!P1852","v":0}]
[774714,"E",747,14,null,{"$f":"'COG-M'!P1853","v":0}]
[774715,"E",747,15,null,{"$f":"'COG-M'!P1854","v":0}]
[774716,"E",747,16,null,{"$f":"'COG-M'!P1855","v":0}]
[774717,"E",747,17,null,{"$f":"'COG-M'!P1856","v":0}]
[774725,"E",747,25,null,{"$f":"'COG-M'!P1857","v":0}]
[774726,"E",747,26,null,{"$f":"'COG-M'!P1858","v":0}]
[774727,"E",747,27,null,{"$f":"'COG-M'!P1859","v":0}]
[774811,"E",748,11,"Concesión de préstamos al sector privado con fines de gestión de liquidez",{"$f":"'COG-M'!P1860","v":0}]
[774814,"E",748,14,null,{"$f":"'COG-M'!P1861","v":0}]
[774815,"E",748,15,null,{"$f":"'COG-M'!P1862","v":0}]
[774816,"E",748,16,null,{"$f":"'COG-M'!P1863","v":0}]
[774817,"E",748,17,null,{"$f":"'COG-M'!P1864","v":0}]
[774825,"E",748,25,null,{"$f":"'COG-M'!P1865","v":0}]
[774826,"E",748,26,null,{"$f":"'COG-M'!P1866","v":0}]
[774827,"E",748,27,null,{"$f":"'COG-M'!P1867","v":0}]
[774911,"E",749,11,"Concesión de  préstamos al sector externo con fines de gestión de liquidez",{"$f":"'COG-M'!P1868","v":0}]
[774914,"E",749,14,null,{"$f":"'COG-M'!P1869","v":0}]
[774915,"E",749,15,null,{"$f":"'COG-M'!P1870","v":0}]
[774916,"E",749,16,null,{"$f":"'COG-M'!P1871","v":0}]
[774917,"E",749,17,null,{"$f":"'COG-M'!P1872","v":0}]
[774925,"E",749,25,null,{"$f":"'COG-M'!P1873","v":0}]
[774926,"E",749,26,null,{"$f":"'COG-M'!P1874","v":0}]
[774927,"E",749,27,null,{"$f":"'COG-M'!P1875","v":0}]
[750000,"E",7500,{"v":0,"d":"00"},"INVERSIONES EN FIDEICOMISOS, MANDATOS Y OTROS  ANÁLOGOS",{"$f":"'COG-M'!P1876","v":0}]
[775111,"E",751,11,"Inversiones en fideicomisos del Poder Ejecutivo",{"$f":"'COG-M'!P1877","v":0}]
[775114,"E",751,14,null,{"$f":"'COG-M'!P1878","v":0}]
[775115,"E",751,15,null,{"$f":"'COG-M'!P1879","v":0}]
[775116,"E",751,16,null,{"$f":"'COG-M'!P1880","v":0}]
[775117,"E",751,17,null,{"$f":"'COG-M'!P1881","v":0}]
[775125,"E",751,25,null,{"$f":"'COG-M'!P1882","v":0}]
[775126,"E",751,26,null,{"$f":"'COG-M'!P1883","v":0}]
[775127,"E",751,27,null,{"$f":"'COG-M'!P1884","v":0}]
[775200,"E",752,{"v":0,"d":"00"},"Inversiones en fideicomisos del Poder Legislativo",{"$f":"'COG-M'!P1885","v":0}]
[775300,"E",753,{"v":0,"d":"00"},"Inversiones en fideicomisos del Poder Judicial",{"$f":"'COG-M'!P1886","v":0}]
[775411,"E",754,11,"Inversiones en fideicomisos públicos no empresariales y no financieros",{"$f":"'COG-M'!P1887","v":0}]
[775414,"E",754,14,null,{"$f":"'COG-M'!P1888","v":0}]
[775415,"E",754,15,null,{"$f":"'COG-M'!P1889","v":0}]
[775416,"E",754,16,null,{"$f":"'COG-M'!P1890","v":0}]
[775417,"E",754,17,null,{"$f":"'COG-M'!P1891","v":0}]
[775425,"E",754,25,null,{"$f":"'COG-M'!P1892","v":0}]
[775426,"E",754,26,null,{"$f":"'COG-M'!P1893","v":0}]
[775427,"E",754,27,null,{"$f":"'COG-M'!P1894","v":0}]
[775500,"E",755,{"v":0,"d":"00"},"Inversiones en fideicomisos públicos empresariales y no financieros",{"$f":"'COG-M'!P1895","v":0}]
[775600,"E",756,{"v":0,"d":"00"},"Inversiones en fideicomisos públicos financieros ",{"$f":"'COG-M'!P1896","v":0}]
[775711,"E",757,11,"Inversiones en fideicomisos de entidades federativas",{"$f":"'COG-M'!P1897","v":0}]
[775714,"E",757,14,null,{"$f":"'COG-M'!P1898","v":0}]
[775715,"E",757,15,null,{"$f":"'COG-M'!P1899","v":0}]
[775716,"E",757,16,null,{"$f":"'COG-M'!P1900","v":0}]
[775717,"E",757,17,null,{"$f":"'COG-M'!P1901","v":0}]
[775725,"E",757,25,null,{"$f":"'COG-M'!P1902","v":0}]
[775726,"E",757,26,null,{"$f":"'COG-M'!P1903","v":0}]
[775727,"E",757,27,null,{"$f":"'COG-M'!P1904","v":0}]
[775800,"E",758,{"v":0,"d":"00"},"Inversiones en fideicomisos de municipios",{"$f":"'COG-M'!P1905","v":0}]
[775911,"E",759,11,"Otras inversiones en fideicomisos",{"$f":"'COG-M'!P1906","v":0}]
[775914,"E",759,14,null,{"$f":"'COG-M'!P1907","v":0}]
[775915,"E",759,15,null,{"$f":"'COG-M'!P1908","v":0}]
[775916,"E",759,16,null,{"$f":"'COG-M'!P1909","v":0}]
[775917,"E",759,17,null,{"$f":"'COG-M'!P1910","v":0}]
[775925,"E",759,25,null,{"$f":"'COG-M'!P1911","v":0}]
[775926,"E",759,26,null,{"$f":"'COG-M'!P1912","v":0}]
[775927,"E",759,27,null,{"$f":"'COG-M'!P1913","v":0}]
[760000,"E",7600,{"v":0,"d":"00"},"OTRAS INVERSIONES FINANCIERAS",{"$f":"'COG-M'!P1914","v":0}]
[776111,"E",761,11,"Depósitos a largo plazo en moneda nacional",{"$f":"'COG-M'!P1915","v":0}]
[776114,"E",761,14,null,{"$f":"'COG-M'!P1916","v":0}]
[776115,"E",761,15,null,{"$f":"'COG-M'!P1917","v":0}]
[776116,"E",761,16,null,{"$f":"'COG-M'!P1918","v":0}]
[776117,"E",761,17,null,{"$f":"'COG-M'!P1919","v":0}]
[776125,"E",761,25,null,{"$f":"'COG-M'!P1920","v":0}]
[776126,"E",761,26,null,{"$f":"'COG-M'!P1921","v":0}]
[776127,"E",761,27,null,{"$f":"'COG-M'!P1922","v":0}]
[776211,"E",762,11,"Depósitos a largo plazo en moneda extranjera",{"$f":"'COG-M'!P1923","v":0}]
[776214,"E",762,14,null,{"$f":"'COG-M'!P1924","v":0}]
[776215,"E",762,15,null,{"$f":"'COG-M'!P1925","v":0}]
[776216,"E",762,16,null,{"$f":"'COG-M'!P1926","v":0}]
[776217,"E",762,17,null,{"$f":"'COG-M'!P1927","v":0}]
[776225,"E",762,25,null,{"$f":"'COG-M'!P1928","v":0}]
[776226,"E",762,26,null,{"$f":"'COG-M'!P1929","v":0}]
[776227,"E",762,27,null,{"$f":"'COG-M'!P1930","v":0}]
[790000,"E",7900,{"v":0,"d":"00"},"PROVISIONES PARA CONTINGENCIAS Y OTRAS EROGACIONES ESPECIALES",{"$f":"'COG-M'!P1931","v":0}]
[779111,"E",791,11,"Contingencias por fenómenos naturales",{"$f":"'COG-M'!P1932","v":0}]
[779114,"E",791,14,null,{"$f":"'COG-M'!P1933","v":0}]
[779115,"E",791,15,null,{"$f":"'COG-M'!P1934","v":0}]
[779116,"E",791,16,null,{"$f":"'COG-M'!P1935","v":0}]
[779117,"E",791,17,null,{"$f":"'COG-M'!P1936","v":0}]
[779125,"E",791,25,null,{"$f":"'COG-M'!P1937","v":0}]
[779126,"E",791,26,null,{"$f":"'COG-M'!P1938","v":0}]
[779127,"E",791,27,null,{"$f":"'COG-M'!P1939","v":0}]
[779211,"E",792,11,"Contingencias socioeconómicas",{"$f":"'COG-M'!P1940","v":0}]
[779214,"E",792,14,null,{"$f":"'COG-M'!P1941","v":0}]
[779215,"E",792,15,null,{"$f":"'COG-M'!P1942","v":0}]
[779216,"E",792,16,null,{"$f":"'COG-M'!P1943","v":0}]
[779217,"E",792,17,null,{"$f":"'COG-M'!P1944","v":0}]
[779225,"E",792,25,null,{"$f":"'COG-M'!P1945","v":0}]
[779226,"E",792,26,null,{"$f":"'COG-M'!P1946","v":0}]
[779227,"E",792,27,null,{"$f":"'COG-M'!P1947","v":0}]
[779911,"E",799,11,"Otras erogaciones especiales",{"$f":"'COG-M'!P1948","v":0}]
[779914,"E",799,14,null,{"$f":"'COG-M'!P1949","v":0}]
[779915,"E",799,15,null,{"$f":"'COG-M'!P1950","v":0}]
[779916,"E",799,16,null,{"$f":"'COG-M'!P1951","v":0}]
[779917,"E",799,17,null,{"$f":"'COG-M'!P1952","v":0}]
[779925,"E",799,25,null,{"$f":"'COG-M'!P1953","v":0}]
[779926,"E",799,26,null,{"$f":"'COG-M'!P1954","v":0}]
[779927,"E",799,27,null,{"$f":"'COG-M'!P1955","v":0}]
[800000,"E",8000,{"v":0,"d":"00"},"PARTICIPACIONES Y APORTACIONES",{"$f":"'COG-M'!P1956","v":0}]
[810000,"E",8100,{"v":0,"d":"00"},"PARTICIPACIONES",{"$f":"'COG-M'!P1957","v":0}]
[881100,"E",811,{"v":0,"d":"00"},"Fondo general de participaciones",{"$f":"'COG-M'!P1958","v":0}]
[881200,"E",812,{"v":0,"d":"00"},"Fondo de fomento municipal",{"$f":"'COG-M'!P1959","v":0}]
[881300,"E",813,{"v":0,"d":"00"},"Participaciones de las entidades federativas a los municipios",{"$f":"'COG-M'!P1960","v":0}]
[881400,"E",814,{"v":0,"d":"00"},"Otros conceptos participables de la Federación a entidades federativas",{"$f":"'COG-M'!P1961","v":0}]
[881500,"E",815,{"v":0,"d":"00"},"Otros conceptos participables de la Federación a municipios",{"$f":"'COG-M'!P1962","v":0}]
[881611,"E",816,11,"Convenios de colaboración administrativa",{"$f":"'COG-M'!P1963","v":0}]
[881612,"E",816,12,null,{"$f":"'COG-M'!P1964","v":0}]
[881614,"E",816,14,null,{"$f":"'COG-M'!P1965","v":0}]
[881615,"E",816,15,null,{"$f":"'COG-M'!P1966","v":0}]
[881616,"E",816,16,null,{"$f":"'COG-M'!P1967","v":0}]
[881617,"E",816,17,null,{"$f":"'COG-M'!P1968","v":0}]
[881625,"E",816,25,null,{"$f":"'COG-M'!P1969","v":0}]
[881626,"E",816,26,null,{"$f":"'COG-M'!P1970","v":0}]
[881627,"E",816,27,null,{"$f":"'COG-M'!P1971","v":0}]
[830000,"E",8300,{"v":0,"d":"00"},"APORTACIONES",{"$f":"'COG-M'!P1972","v":0}]
[883100,"E",831,{"v":0,"d":"00"},"Aportaciones de la Federación a las entidades federativas",{"$f":"'COG-M'!P1973","v":0}]
[883200,"E",832,{"v":0,"d":"00"},"Aportaciones de la Federación a municipios",{"$f":"'COG-M'!P1974","v":0}]
[883300,"E",833,{"v":0,"d":"00"},"Aportaciones de las entidades federativas a los municipios",{"$f":"'COG-M'!P1975","v":0}]
[883400,"E",834,{"v":0,"d":"00"},"Aportaciones  previstas en leyes y decretos al sistema de protección social",{"$f":"'COG-M'!P1976","v":0}]
[883500,"E",835,{"v":0,"d":"00"},"Aportaciones previstas en leyes y decretos compensatorias a entidades federativas y municipios",{"$f":"'COG-M'!P1977","v":0}]
[850000,"E",8500,{"v":0,"d":"00"},"CONVENIOS",{"$f":"'COG-M'!P1978","v":0}]
[885111,"E",851,11,"Convenios de reasignación",{"$f":"'COG-M'!P1979","v":0}]
[885112,"E",851,12,null,{"$f":"'COG-M'!P1980","v":0}]
[885114,"E",851,14,null,{"$f":"'COG-M'!P1981","v":0}]
[885115,"E",851,15,null,{"$f":"'COG-M'!P1982","v":0}]
[885116,"E",851,16,null,{"$f":"'COG-M'!P1983","v":0}]
[885117,"E",851,17,null,{"$f":"'COG-M'!P1984","v":0}]
[885125,"E",851,25,null,{"$f":"'COG-M'!P1985","v":0}]
[885126,"E",851,26,null,{"$f":"'COG-M'!P1986","v":0}]
[885127,"E",851,27,null,{"$f":"'COG-M'!P1987","v":0}]
[885211,"E",852,11,"Convenios de descentralización",{"$f":"'COG-M'!P1988","v":0}]
[885212,"E",852,12,null,{"$f":"'COG-M'!P1989","v":0}]
[885214,"E",852,14,null,{"$f":"'COG-M'!P1990","v":0}]
[885215,"E",852,15,null,{"$f":"'COG-M'!P1991","v":0}]
[885216,"E",852,16,null,{"$f":"'COG-M'!P1992","v":0}]
[885217,"E",852,17,null,{"$f":"'COG-M'!P1993","v":0}]
[885225,"E",852,25,null,{"$f":"'COG-M'!P1994","v":0}]
[885226,"E",852,26,null,{"$f":"'COG-M'!P1995","v":0}]
[885227,"E",852,27,null,{"$f":"'COG-M'!P1996","v":0}]
[885311,"E",853,11,"Otros convenios",{"$f":"'COG-M'!P1997","v":0}]
[885312,"E",853,12,null,{"$f":"'COG-M'!P1998","v":0}]
[885314,"E",853,14,null,{"$f":"'COG-M'!P1999","v":0}]
[885315,"E",853,15,null,{"$f":"'COG-M'!P2000","v":0}]
[885316,"E",853,16,null,{"$f":"'COG-M'!P2001","v":0}]
[885317,"E",853,17,null,{"$f":"'COG-M'!P2002","v":0}]
[885325,"E",853,25,null,{"$f":"'COG-M'!P2003","v":0}]
[885326,"E",853,26,null,{"$f":"'COG-M'!P2004","v":0}]
[885327,"E",853,27,null,{"$f":"'COG-M'!P2005","v":0}]
[900000,"E",9000,{"v":0,"d":"00"},"DEUDA  PÚBLICA",{"$f":"'COG-M'!P2006","v":0}]
[910000,"E",9100,{"v":0,"d":"00"},"AMORTIZACIÓN DE LA DEUDA PÚBLICA ",{"$f":"'COG-M'!P2007","v":0}]
[991111,"E",911,11,"Amortización de la deuda interna con instituciones de crédito",{"$f":"'COG-M'!P2008","v":0}]
[991114,"E",911,14,null,{"$f":"'COG-M'!P2009","v":0}]
[991115,"E",911,15,null,{"$f":"'COG-M'!P2010","v":0}]
[991116,"E",911,16,null,{"$f":"'COG-M'!P2011","v":0}]
[991117,"E",911,17,null,{"$f":"'COG-M'!P2012","v":0}]
[991125,"E",911,25,null,{"$f":"'COG-M'!P2013","v":0}]
[991211,"E",912,11,"Amortización  de la deuda interna por emisión de títulos y valores",{"$f":"'COG-M'!P2014","v":0}]
[991214,"E",912,14,null,{"$f":"'COG-M'!P2015","v":0}]
[991215,"E",912,15,null,{"$f":"'COG-M'!P2016","v":0}]
[991216,"E",912,16,null,{"$f":"'COG-M'!P2017","v":0}]
[991217,"E",912,17,null,{"$f":"'COG-M'!P2018","v":0}]
[991225,"E",912,25,null,{"$f":"'COG-M'!P2019","v":0}]
[991311,"E",913,11,"Amortización de arrendamientos financieros nacionales",{"$f":"'COG-M'!P2020","v":0}]
[991314,"E",913,14,null,{"$f":"'COG-M'!P2021","v":0}]
[991315,"E",913,15,null,{"$f":"'COG-M'!P2022","v":0}]
[991316,"E",913,16,null,{"$f":"'COG-M'!P2023","v":0}]
[991317,"E",913,17,null,{"$f":"'COG-M'!P2024","v":0}]
[991325,"E",913,25,null,{"$f":"'COG-M'!P2025","v":0}]
[991400,"E",914,{"v":0,"d":"00"},"Amortización de la deuda externa con instituciones de crédito ",{"$f":"'COG-M'!P2026","v":0}]
[991500,"E",915,{"v":0,"d":"00"},"Amortización de deuda externa con organismos financieros internacionales",{"$f":"'COG-M'!P2027","v":0}]
[991600,"E",916,{"v":0,"d":"00"},"Amortización de la deuda bilateral",{"$f":"'COG-M'!P2028","v":0}]
[991700,"E",917,{"v":0,"d":"00"},"Amortización de la deuda externa por emisión de títulos y valores",{"$f":"'COG-M'!P2029","v":0}]
[991800,"E",918,{"v":0,"d":"00"},"Amortización de arrendamientos financieros internacionales",{"$f":"'COG-M'!P2030","v":0}]
[920000,"E",9200,{"v":0,"d":"00"},"INTERESES DE LA DEUDA PÚBLICA",{"$f":"'COG-M'!P2031","v":0}]
[992111,"E",921,11,"Intereses de la deuda interna con instituciones de crédito",{"$f":"'COG-M'!P2032","v":0}]
[992114,"E",921,14,null,{"$f":"'COG-M'!P2033","v":0}]
[992115,"E",921,15,null,{"$f":"'COG-M'!P2034","v":0}]
[992116,"E",921,16,null,{"$f":"'COG-M'!P2035","v":0}]
[992117,"E",921,17,null,{"$f":"'COG-M'!P2036","v":0}]
[992125,"E",921,25,null,{"$f":"'COG-M'!P2037","v":0}]
[992211,"E",922,11,"Intereses derivados de la colocación de títulos y valores",{"$f":"'COG-M'!P2038","v":0}]
[992214,"E",922,14,null,{"$f":"'COG-M'!P2039","v":0}]
[992215,"E",922,15,null,{"$f":"'COG-M'!P2040","v":0}]
[992216,"E",922,16,null,{"$f":"'COG-M'!P2041","v":0}]
[992217,"E",922,17,null,{"$f":"'COG-M'!P2042","v":0}]
[992225,"E",922,25,null,{"$f":"'COG-M'!P2043","v":0}]
[992311,"E",923,11,"Intereses por arrendamientos  financieros nacionales",{"$f":"'COG-M'!P2044","v":0}]
[992314,"E",923,14,null,{"$f":"'COG-M'!P2045","v":0}]
[992315,"E",923,15,null,{"$f":"'COG-M'!P2046","v":0}]
[992316,"E",923,16,null,{"$f":"'COG-M'!P2047","v":0}]
[992317,"E",923,17,null,{"$f":"'COG-M'!P2048","v":0}]
[992325,"E",923,25,null,{"$f":"'COG-M'!P2049","v":0}]
[992400,"E",924,{"v":0,"d":"00"},"Intereses de la deuda externa con instituciones de crédito ",{"$f":"'COG-M'!P2050","v":0}]
[992500,"E",925,{"v":0,"d":"00"},"Intereses de la deuda con organismos financieros internacionales",{"$f":"'COG-M'!P2051","v":0}]
[992600,"E",926,{"v":0,"d":"00"},"Intereses de la deuda bilateral  ",{"$f":"'COG-M'!P2052","v":0}]
[992700,"E",927,{"v":0,"d":"00"},"Intereses derivados de la colocación de títulos y valores en el exterior",{"$f":"'COG-M'!P2053","v":0}]
[992800,"E",928,{"v":0,"d":"00"},"Intereses por arrendamientos financieros internacionales",{"$f":"'COG-M'!P2054","v":0}]
[930000,"E",9300,{"v":0,"d":"00"},"COMISIONES DE LA DEUDA PÚBLICA",{"$f":"'COG-M'!P2055","v":0}]
[993111,"E",931,11,"Comisiones de la deuda pública interna",{"$f":"'COG-M'!P2056","v":0}]
[993114,"E",931,14,null,{"$f":"'COG-M'!P2057","v":0}]
[993115,"E",931,15,null,{"$f":"'COG-M'!P2058","v":0}]
[993116,"E",931,16,null,{"$f":"'COG-M'!P2059","v":0}]
[993117,"E",931,17,null,{"$f":"'COG-M'!P2060","v":0}]
[993125,"E",931,25,null,{"$f":"'COG-M'!P2061","v":0}]
[993200,"E",932,{"v":0,"d":"00"},"Comisiones de la deuda pública externa",{"$f":"'COG-M'!P2062","v":0}]
[940000,"E",9400,{"v":0,"d":"00"},"GASTOS DE LA DEUDA PÚBLICA",{"$f":"'COG-M'!P2063","v":0}]
[994111,"E",941,11,"Gastos de la deuda pública interna",{"$f":"'COG-M'!P2064","v":0}]
[994114,"E",941,14,null,{"$f":"'COG-M'!P2065","v":0}]
[994115,"E",941,15,null,{"$f":"'COG-M'!P2066","v":0}]
[994116,"E",941,16,null,{"$f":"'COG-M'!P2067","v":0}]
[994117,"E",941,17,null,{"$f":"'COG-M'!P2068","v":0}]
[994125,"E",941,25,null,{"$f":"'COG-M'!P2069","v":0}]
[994200,"E",942,{"v":0,"d":"00"},"Gastos de la deuda  pública externa",{"$f":"'COG-M'!P2070","v":0}]
[950000,"E",9500,{"v":0,"d":"00"},"COSTO POR COBERTURAS",{"$f":"'COG-M'!P2071","v":0}]
[995111,"E",951,11,"Costos por coberturas",{"$f":"'COG-M'!P2072","v":0}]
[995114,"E",951,14,null,{"$f":"'COG-M'!P2073","v":0}]
[995115,"E",951,15,null,{"$f":"'COG-M'!P2074","v":0}]
[995116,"E",951,16,null,{"$f":"'COG-M'!P2075","v":0}]
[995117,"E",951,17,null,{"$f":"'COG-M'!P2076","v":0}]
[995125,"E",951,25,null,{"$f":"'COG-M'!P2077","v":0}]
[960000,"E",9600,{"v":0,"d":"00"},"APOYOS FINANCIEROS",{"$f":"'COG-M'!P2078","v":0}]
[996100,"E",961,{"v":0,"d":"00"},"Apoyos a intermediarios financieros",{"$f":"'COG-M'!P2079","v":0}]
[996200,"E",962,{"v":0,"d":"00"},"Apoyos a ahorradores y deudores del Sistema Financiero Nacional",{"$f":"'COG-M'!P2080","v":0}]
[990000,"E",9900,{"v":0,"d":"00"},"ADEUDOS DE EJERCICIOS FISCALES ANTERIORES (ADEFAS)",{"$f":"'COG-M'!P2081","v":0}]
[999111,"E",991,11,"ADEFAS",{"$f":"'COG-M'!P2082","v":0}]
[999114,"E",991,14,null,{"$f":"'COG-M'!P2083","v":0}]
[999115,"E",991,15,null,{"$f":"'COG-M'!P2084","v":0}]
[999116,"E",991,16,null,{"$f":"'COG-M'!P2085","v":0}]
[999117,"E",991,17,null,{"$f":"'COG-M'!P2086","v":0}]
[999125,"E",991,25,null,{"$f":"'COG-M'!P2087","v":0}]
[null,"E",null,null,"TOTAL DE EGRESOS",{"$f":"'COG-M'!P2088","v":{"v":2205131,"d":"2,205,131"}}]
[1,"F",null,null,"GOBIERNO",{"$f":"CF!C3","v":{"v":2205131,"d":"2,205,131"}}]
[11,"F",null,null,"LEGISLACIÓN",{"$f":"CF!C4","v":0}]
[111,"F",null,null,"Legislación",{"$f":"CF!C5","v":0}]
[112,"F",null,null,"Fiscalización",{"$f":"CF!C6","v":0}]
[12,"F",null,null,"JUSTICIA",{"$f":"CF!C7","v":0}]
[121,"F",null,null,"Impartición de justicia",{"$f":"CF!C8","v":0}]
[122,"F",null,null,"Procuración de justicia",{"$f":"CF!C9","v":0}]
[123,"F",null,null,"Reclusión y readaptación social",{"$f":"CF!C10","v":0}]
[124,"F",null,null,"Derechos humanos",{"$f":"CF!C11","v":0}]
[13,"F",null,null,"COORDINACIÓN DE LA POLÍTICA DE GOBIERNO",{"$f":"CF!C12","v":{"v":2205131,"d":"2,205,131"}}]
[131,"F",null,null,"Presidencia/Gubernatura",{"$f":"CF!C13","v":0}]
[132,"F",null,null,"Política interior",{"$f":"CF!C14","v":0}]
[133,"F",null,null,"Preservación y cuidado del patrimonio público",{"$f":"CF!C15","v":0}]
[134,"F",null,null,"Función pública",{"$f":"CF!C16","v":0}]
[135,"F",null,null,"Asuntos jurídicos",{"$f":"CF!C17","v":0}]
[136,"F",null,null,"Organización de procesos electorales",{"$f":"CF!C18","v":0}]
[137,"F",null,null,"Población",{"$f":"CF!C19","v":{"v":2205131,"d":"2,205,131"}}]
[138,"F",null,null,"Territorio",{"$f":"CF!C20","v":0}]
[139,"F",null,null,"Otros",{"$f":"CF!C21","v":0}]
[14,"F",null,null,"RELACIONES EXTERIORES",{"$f":"CF!C22","v":0}]
[141,"F",null,null,"Relaciones exteriores",{"$f":"CF!C23","v":0}]
[15,"F",null,null,"ASUNTOS FINANCIEROS Y HACENDARIOS",{"$f":"CF!C24","v":0}]
[151,"F",null,null,"Asuntos financieros  ",{"$f":"CF!C25","v":0}]
[152,"F",null,null,"Asuntos hacendarios",{"$f":"CF!C26","v":0}]
[16,"F",null,null,"SEGURIDAD NACIONAL",{"$f":"CF!C27","v":0}]
[161,"F",null,null,"Defensa",{"$f":"CF!C28","v":0}]
[162,"F",null,null,"Marina",{"$f":"CF!C29","v":0}]
[163,"F",null,null,"Inteligencia para la preservación de la seguridad nacional",{"$f":"CF!C30","v":0}]
[17,"F",null,null,"ASUNTOS DE ORDEN PÚBLICO Y DE SEGURIDAD INTERIOR",{"$f":"CF!C31","v":0}]
[171,"F",null,null,"Policía",{"$f":"CF!C32","v":0}]
[172,"F",null,null,"Protección civil",{"$f":"CF!C33","v":0}]
[173,"F",null,null,"Otros asuntos de orden público y seguridad",{"$f":"CF!C34","v":0}]
[174,"F",null,null,"Sistema nacional de seguridad pública",{"$f":"CF!C35","v":0}]
[18,"F",null,null,"OTROS SERVICIOS GENERALES",{"$f":"CF!C36","v":0}]
[181,"F",null,null,"Servicios registrales, administrativos y patrimoniales",{"$f":"CF!C37","v":0}]
[182,"F",null,null,"Servicios estadísticos",{"$f":"CF!C38","v":0}]
[183,"F",null,null,"Servicios de comunicación y medios",{"$f":"CF!C39","v":0}]
[184,"F",null,null,"Acceso a la información pública gubernamental",{"$f":"CF!C40","v":0}]
[185,"F",null,null,"Otros",{"$f":"CF!C41","v":0}]
[2,"F",null,null,"DESARROLLO SOCIAL",{"$f":"CF!C42","v":0}]
[21,"F",null,null,"PROTECCIÓN AMBIENTAL",{"$f":"CF!C43","v":0}]
[211,"F",null,null,"Ordenación de desechos",{"$f":"CF!C44","v":0}]
[212,"F",null,null,"Administración del agua",{"$f":"CF!C45","v":0}]
[213,"F",null,null,"Ordenación de aguas residuales, drenaje y alcantarillado",{"$f":"CF!C46","v":0}]
[214,"F",null,null,"Reducción de la contaminación",{"$f":"CF!C47","v":0}]
[215,"F",null,null,"Protección de la diversidad biológica y del paisaje",{"$f":"CF!C48","v":0}]
[216,"F",null,null,"Otros de protección ambiental",{"$f":"CF!C49","v":0}]
[22,"F",null,null,"VIVIENDA Y SERVICIOS A LA COMUNIDAD",{"$f":"CF!C50","v":0}]
[221,"F",null,null,"Urbanización",{"$f":"CF!C51","v":0}]
[222,"F",null,null,"Desarrollo comunitario",{"$f":"CF!C52","v":0}]
[223,"F",null,null,"Abastecimiento de agua",{"$f":"CF!C53","v":0}]
[224,"F",null,null,"Alumbrado público",{"$f":"CF!C54","v":0}]
[225,"F",null,null,"Vivienda",{"$f":"CF!C55","v":0}]
[226,"F",null,null,"Servicios comunales",{"$f":"CF!C56","v":0}]
[227,"F",null,null,"Desarrollo regional",{"$f":"CF!C57","v":0}]
[23,"F",null,null,"SALUD",{"$f":"CF!C58","v":0}]
[231,"F",null,null,"Prestación de servicios de salud a la comunidad",{"$f":"CF!C59","v":0}]
[232,"F",null,null,"Prestación de servicios de salud a la persona",{"$f":"CF!C60","v":0}]
[233,"F",null,null,"Generación de recursos para la salud",{"$f":"CF!C61","v":0}]
[234,"F",null,null,"Rectoría del sistema de salud",{"$f":"CF!C62","v":0}]
[235,"F",null,null,"Protección social en salud",{"$f":"CF!C63","v":0}]
[24,"F",null,null,"RECREACIÓN, CULTURA Y OTRAS MANIFESTACIONES SOCIALES",{"$f":"CF!C64","v":0}]
[241,"F",null,null,"Deporte y recreación",{"$f":"CF!C65","v":0}]
[242,"F",null,null,"Cultura",{"$f":"CF!C66","v":0}]
[243,"F",null,null,"Radio, televisión y editoriales",{"$f":"CF!C67","v":0}]
[244,"F",null,null,"Asuntos religiosos y otras manifestaciones sociales",{"$f":"CF!C68","v":0}]
[25,"F",null,null,"EDUCACIÓN",{"$f":"CF!C69","v":0}]
[251,"F",null,null,"Educación básica",{"$f":"CF!C70","v":0}]
[252,"F",null,null,"Educación media superior",{"$f":"CF!C71","v":0}]
[253,"F",null,null,"Educación superior",{"$f":"CF!C72","v":0}]
[254,"F",null,null,"Posgrado",{"$f":"CF!C73","v":0}]
[255,"F",null,null,"Educación para adultos",{"$f":"CF!C74","v":0}]
[256,"F",null,null,"Otros servicios educativos y actividades inherentes",{"$f":"CF!C75","v":0}]
[26,"F",null,null,"PROTECCIÓN SOCIAL  ",{"$f":"CF!C76","v":0}]
[261,"F",null,null,"Enfermedades e incapacidad",{"$f":"CF!C77","v":0}]
[262,"F",null,null,"Edad avanzada",{"$f":"CF!C78","v":0}]
[263,"F",null,null,"Familia e hijos",{"$f":"CF!C79","v":0}]
[264,"F",null,null,"Desempleo",{"$f":"CF!C80","v":0}]
[265,"F",null,null,"Alimentación y nutrición",{"$f":"CF!C81","v":0}]
[266,"F",null,null,"Apoyo social para la vivienda",{"$f":"CF!C82","v":0}]
[267,"F",null,null,"Indígenas",{"$f":"CF!C83","v":0}]
[268,"F",null,null,"Otros grupos vulnerables",{"$f":"CF!C84","v":0}]
[269,"F",null,null,"Otros de seguridad social y asistencia social",{"$f":"CF!C85","v":0}]
[27,"F",null,null,"OTROS ASUNTOS SOCIALES",{"$f":"CF!C86","v":0}]
[271,"F",null,null,"Otros asuntos sociales",{"$f":"CF!C87","v":0}]
[3,"F",null,null,"DESARROLLO ECONÓMICO",{"$f":"CF!C88","v":0}]
[31,"F",null,null,"ASUNTOS ECONÓMICOS, COMERCIALES Y LABORALES EN GENERAL",{"$f":"CF!C89","v":0}]
[311,"F",null,null,"Asuntos económicos y comerciales en general",{"$f":"CF!C90","v":0}]
[312,"F",null,null,"Asuntos laborales generales",{"$f":"CF!C91","v":0}]
[32,"F",null,null,"AGROPECUARÍA, SILVICULTURA, PESCA Y CAZA",{"$f":"CF!C92","v":0}]
[321,"F",null,null,"Agropecuaria",{"$f":"CF!C93","v":0}]
[322,"F",null,null,"Silvicultura",{"$f":"CF!C94","v":0}]
[323,"F",null,null,"Acuacultura, pesca y caza",{"$f":"CF!C95","v":0}]
[324,"F",null,null,"Agroindustrial",{"$f":"CF!C96","v":0}]
[325,"F",null,null,"Hidroagrícola",{"$f":"CF!C97","v":0}]
[326,"F",null,null,"Apoyo financiero a la banca y seguro agropecuario",{"$f":"CF!C98","v":0}]
[33,"F",null,null,"COMBUSTIBLE Y ENERGÍA",{"$f":"CF!C99","v":0}]
[331,"F",null,null,"Carbón y otros combustibles minerales sólidos",{"$f":"CF!C100","v":0}]
[332,"F",null,null,"Petróleo y gas natural (hidrocarburos)",{"$f":"CF!C101","v":0}]
[333,"F",null,null,"Combustibles Nucleares",{"$f":"CF!C102","v":0}]
[334,"F",null,null,"Otros combustibles",{"$f":"CF!C103","v":0}]
[335,"F",null,null,"Electricidad",{"$f":"CF!C104","v":0}]
[336,"F",null,null,"Energía no Eléctrica",{"$f":"CF!C105","v":0}]
[34,"F",null,null,"MINERÍA, MANUFACTURAS Y CONSTRUCCIÓN",{"$f":"CF!C106","v":0}]
[341,"F",null,null,"Extracción de recursos minerales excepto los combustibles minerales",{"$f":"CF!C107","v":0}]
[342,"F",null,null,"Manufacturas",{"$f":"CF!C108","v":0}]
[343,"F",null,null,"Construcción",{"$f":"CF!C109","v":0}]
[35,"F",null,null,"TRANSPORTE",{"$f":"CF!C110","v":0}]
[351,"F",null,null,"Transporte por carretera",{"$f":"CF!C111","v":0}]
[352,"F",null,null,"Transporte por agua y puertos",{"$f":"CF!C112","v":0}]
[353,"F",null,null,"Transporte por ferrocarril",{"$f":"CF!C113","v":0}]
[354,"F",null,null,"Transporte aéreo",{"$f":"CF!C114","v":0}]
[355,"F",null,null,"Transporte por oleoductos y gasoductos y otros sistemas de transporte",{"$f":"CF!C115","v":0}]
[356,"F",null,null,"Otros relacionados con transporte",{"$f":"CF!C116","v":0}]
[36,"F",null,null,"COMUNICACIONES",{"$f":"CF!C117","v":0}]
[361,"F",null,null,"Comunicaciones",{"$f":"CF!C118","v":0}]
[37,"F",null,null,"TURISMO",{"$f":"CF!C119","v":0}]
[371,"F",null,null,"Turismo",{"$f":"CF!C120","v":0}]
[372,"F",null,null,"Hoteles y restaurantes",{"$f":"CF!C121","v":0}]
[38,"F",null,null,"CIENCIA, TECNOLOGÍA E INNOVACIÓN",{"$f":"CF!C122","v":0}]
[381,"F",null,null,"Investigación científica",{"$f":"CF!C123","v":0}]
[382,"F",null,null,"Desarrollo tecnológico",{"$f":"CF!C124","v":0}]
[383,"F",null,null,"Servicios científicos y tecnológicos",{"$f":"CF!C125","v":0}]
[384,"F",null,null,"Innovación",{"$f":"CF!C126","v":0}]
[39,"F",null,null,"OTRAS INDUSTRIAS Y OTROS ASUNTOS ECONÓMICOS",{"$f":"CF!C127","v":0}]
[391,"F",null,null,"Comercio, distribución, almacenamiento y depósito",{"$f":"CF!C128","v":0}]
[392,"F",null,null,"Otras industrias  ",{"$f":"CF!C129","v":0}]
[393,"F",null,null,"Otros asuntos económicos",{"$f":"CF!C130","v":0}]
[4,"F",null,null,"OTRAS NO CLASIFICADAS EN FUNCIONES ANTERIORES",{"$f":"CF!C131","v":0}]
[41,"F",null,null,"TRANSACCIONES DE LA DEUDA PÚBLICA/COSTO FINANCIERO DE LA DEUDA",{"$f":"CF!C132","v":0}]
[411,"F",null,null,"Deuda pública interna",{"$f":"CF!C133","v":0}]
[412,"F",null,null,"Deuda pública externa",{"$f":"CF!C134","v":0}]
[42,"F",null,null,"TRANSFERENCIAS, PARTICIPACIONES Y APORTACIONES ENTRE DIFERENTES NIVELES Y ORDENES DE GOBIERNO",{"$f":"CF!C135","v":0}]
[421,"F",null,null,"Transferencia entre diferentes niveles y ordenes de gobierno",{"$f":"CF!C136","v":0}]
[422,"F",null,null,"Participaciones entre diferentes niveles y ordenes de gobierno",{"$f":"CF!C137","v":0}]
[423,"F",null,null,"Aportaciones entre diferentes niveles y ordenes de gobierno",{"$f":"CF!C138","v":0}]
[43,"F",null,null,"SANEAMIENTO DEL SISTEMA FINANCIERO",{"$f":"CF!C139","v":0}]
[431,"F",null,null,"Saneamiento del sistema financiero",{"$f":"CF!C140","v":0}]
[432,"F",null,null,"Apoyos IPAB",{"$f":"CF!C141","v":0}]
[433,"F",null,null,"Banca de desarrollo",{"$f":"CF!C142","v":0}]
[434,"F",null,null,"Apoyo a los programas de reestructura en unidades de inversión (UDIS)",{"$f":"CF!C143","v":0}]
[44,"F",null,null,"ADEUDOS DE EJERCICIOS FISCALES ANTERIORES  ",{"$f":"CF!C144","v":0}]
[441,"F",null,null,"adeudos de ejercicios fiscales anteriores",{"$f":"CF!C145","v":0}]
[{"$nulls":4},"TOTAL DE EGRESOS",{"$f":"CF!C146","v":{"v":2205131,"d":"2,205,131"}}]

{"sheet":"CRI-RYP","index":5,"n_rows":35,"n_cols":8,"rows_kept":35}
[null,"Resultado\n2017","Resultado\n2018","Resultado\n2019","Estimación\n2020","Proyección\n2021","Proyección\n2022","Proyección\n2023"]
["INGRESOS DE LIBRE DISPOSCIÓN"]
["Impuestos",{"$nulls":3},{"$f":"'CRI-DE'!F2","v":0}]
["Cuotas y aportaciones de seguridad social",{"$nulls":3},{"$f":"'CRI-DE'!F21","v":0}]
["Contribuciones de mejoras",{"$nulls":3},{"$f":"'CRI-DE'!F27","v":0}]
["Derechos",{"$nulls":3},{"$f":"'CRI-DE'!F30","v":0}]
["Productos",{"v":115879,"d":"115,879"},{"v":121673,"d":"121,673"},{"v":127757,"d":"127,757"},{"$f":"'CRI-DE'!F60","v":{"v":130343,"d":"130,343"}},{"v":137364,"d":"137,364"},{"v":144232,"d":"144,232"},{"v":148559,"d":"148,559"}]
["Aprovechamientos",{"$nulls":3},{"$f":"'CRI-DE'!F65","v":0}]
["Ingresos por venta de bienes y prestación de servicios",{"$nulls":3},{"$f":"'CRI-DE'!F79","v":0}]
["Participaciones",{"$nulls":3},{"$f":"'CRI-DE'!F94","v":0}]
["Incentivos derivados de la colaboración fiscal",{"$nulls":3},{"$f":"'CRI-DE'!F115","v":0}]
["Transferencias y asignaciones",{"v":1767009,"d":"1,767,009"},{"v":1837690,"d":"1,837,690"},{"v":1929675,"d":"1,929,675"},{"$f":"'CRI-DE'!D124","v":{"v":2074788,"d":"2,074,788"}},{"v":2178527,"d":"2,178,527"},{"v":2287454,"d":"2,287,454"},{"v":2356077,"d":"2,356,077"}]
["Convenios",{"$nulls":3},{"$f":"'CRI-DE'!D110","v":0}]
["Otros ingresos de libre disposición",{"$nulls":3},0]
["Total de ingresos de libre disposición",{"$f":"SUM(B3:B14)","v":{"v":1882888,"d":"1,882,888"}},{"$f":"SUM(C3:C14)","v":{"v":1959363,"d":"1,959,363"}},{"v":2057432,"d":"2,057,432"},{"v":2205131,"d":"2,205,131"},{"v":2315891,"d":"2,315,891"},{"v":2431686,"d":"2,431,686"},{"v":2504636,"d":"2,504,636"}]
["TRANSFERENCIAS FEDERALES ETIQUETADAS"]
["Aportaciones",{"$nulls":3},{"$f":"'CRI-DE'!E107","v":0}]
["Convenios",{"$nulls":3},{"$f":"'CRI-DE'!E110","v":0}]
["Fondos distintos de aportaciones",{"$nulls":3},{"$f":"'CRI-DE'!E121","v":0}]
["Transferencias, asignaciones, subsidios y subvenciones y pensiones y jubilaciones",{"$nulls":3},{"$f":"'CRI-DE'!E124","v":0}]
["Otras transferencias federales etiquetadas",{"$nulls":3},0]
["Total de ingresos etiquetados",{"$f":"SUM(B17:B21)","v":0},0,0,0,0,0,0]
["Ingresos derivados de financiamientos",{"$f":"B29","v":0},{"$f":"C29","v":0},{"$f":"D29","v":0},{"$f":"E29","v":0}]
["TOTAL DE INGRESOS",{"$f":"B15+B22+B23","v":{"v":1882888,"d":"1,882,888"}},{"$f":"C15+C22+C23","v":{"v":1959363,"d":"1,959,363"}},{"v":2057432,"d":"2,057,432"},{"v":2205131,"d":"2,205,131"},{"v":2315891,"d":"2,315,891"},{"v":2431686,"d":"2,431,686"},{"v":2504636,"d":"2,504,636"}]
[]
["DATOS INFORMATIVOS"]
["Ingresos derivados de financiamientos con fuente de pago de recursos de libre disposición",{"$nulls":3},{"$f":"'CRI-DE'!D136","v":0}]
["Ingresos derivados de financiamientos con fuente de pago de transferencias federales etiquetadas",{"$nulls":3},{"$f":"'CRI-DE'!E136","v":0}]
["Ingresos derivados de financiamiento",{"$f":"SUM(B27:B28)","v":0},0,0,0,0,0,0]
[]
[]
[]
[]
[]
[{"$f":"SUM(B24:H24)","v":{"v":15357027,"d":"15,357,027"}}]

{"sheet":"CRI-DE","index":6,"n_rows":141,"n_cols":6,"rows_kept":141,"merged":[[0,1,0,2],[1,1,1,2],[2,1,2,2],[3,0,3,1],[4,1,4,2],[5,0,5,1],[6,0,6,1],[7,0,7,1],[8,1,8,2],[9,1,9,2],[10,1,10,2],[11,1,11,2],[12,1,12,2],[13,0,13,1],[14,0,14,1],[15,0,15,1],[16,0,16,1],[17,0,17,1],[18,1,18,2],[19,0,19,1],[20,1,20,2],[21,1,21,2],[22,1,22,2],[23,1,23,2],[24,1,24,2],[25,1,25,2],[26,1,26,2],[27,1,27,2],[28,0,28,1],[29,1,29,2],[30,1,30,2],[31,0,31,1],[32,0,32,1],[33,0,33,1],[34,0,34,1],[35,1,35,2],[36,1,36,2],[37,0,37,1],[38,0,38,1],[39,0,39,1],[40,0,40,1],[41,0,41,1],[42,0,42,1],[43,0,43,1],[44,0,44,1],[45,0,45,1],[46,0,46,1],[47,0,47,1],[48,0,48,1],[49,0,49,1],[50,0,50,1],[51,1,51,2],[52,0,52,1],[53,1,53,2],[54,0,54,1],[55,0,55,1],[56,0,56,1],[57,0,57,1],[58,0,58,1],[59,1,59,2],[60,1,60,2],[61,0,61,1],[62,0,62,1],[63,1,63,2],[64,1,64,2],[65,1,65,2],[66,0,66,1],[67,0,67,1],[68,0,68,1],[69,1,69,2],[70,0,70,1],[71,0,71,1],[72,1,72,2],[73,0,73,1],[74,0,74,1],[75,0,75,1],[76,0,76,1],[77,0,77,1],[78,1,78,2],[79,1,79,2],[80,0,80,1],[81,1,81,2],[82,1,82,2],[83,0,83,1],[84,1,84,2],[85,1,85,2],[86,1,86,2],[87,1,87,2],[88,0,88,1],[89,1,89,2],[90,1,90,2],[91,0,91,1],[92,1,92,2],[93,1,93,2],[94,0,94,1],[95,0,95,1],[96,0,96,1],[97,0,97,1],[98,0,98,1],[99,0,99,1],[100,0,100,1],[101,0,101,1],[102,0,102,1],[103,0,103,1],[104,0,104,1],[105,0,105,1],[106,1,106,2],[107,0,107,1],[108,0,108,1],[109,1,109,2],[110,0,110,1],[111,0,111,1],[112,0,112,1],[113,0,113,1],[114,1,114,2],[115,0,115,1],[116,0,116,1],[117,0,117,1],[118,0,118,1],[119,0,119,1],[120,1,120,2],[121,0,121,1],[122,0,122,1],[123,1,123,2],[124,1,124,2],[125,0,125,1],[126,1,126,2],[127,1,127,2],[128,0,128,1],[129,1,129,2],[130,1,130,2],[131,0,131,1],[132,1,132,2],[133,1,133,2],[134,0,134,1],[135,1,135,2],[136,1,136,2],[137,1,137,2],[138,1,138,2],[139,0,139,1],[140,0,140,2]]}
["CRI-LI","DESCRIPCIÓN",null,"INGRESOS DE LIBRE DISPOSICIÓN","INGRESOS ETIQUETADOS","TOTAL"]
[{"v":1000,"d":"10-00"},"IMPUESTOS",null,{"$f":"D3+D5+D9+D10+D11+D12+D13+D19","v":0},{"$f":"E3+E5+E9+E10+E11+E12+E13+E19","v":0},{"$f":"D2+E2","v":0}]
[{"v":1100,"d":"11-00"},"Impuestos sobre los ingresos",null,{"$f":"SUM(D4)","v":0},{"$f":"SUM(E4)","v":0},{"$f":"D3+E3","v":0}]
[{"v":1101,"d":"11-01"},null,"Impuestos sobre espectáculos públicos",{"$f":"'CRI-M'!O4","v":0},null,0]
[{"v":1200,"d":"12-00"},"Impuestos sobre el patrimonio",null,{"$f":"SUM(D6:D8)","v":0},{"$f":"SUM(E6:E8)","v":0},0]
[{"v":1201,"d":"12-01"},null,"Impuesto predial",{"$f":"'CRI-M'!O6","v":0},null,0]
[{"v":1202,"d":"12-02"},null,"Impuestos sobre transmisiones patrimoniales",{"$f":"'CRI-M'!O7","v":0},null,0]
[{"v":1203,"d":"12-03"},null,"Impuestos sobre negocios jurídicos",{"$f":"'CRI-M'!O8","v":0},null,0]
[{"v":1300,"d":"13-00"},"Impuestos sobre la producción, el consumo y las transacciones",null,0,0,0]
[{"v":1400,"d":"14-00"},"Impuestos al comercio exterior",null,0,0,0]
[{"v":1500,"d":"15-00"},"Impuestos sobre nóminas y asimilables",null,0,0,0]
[{"v":1600,"d":"16-00"},"Impuestos ecológicos",null,0,0,0]
[{"v":1700,"d":"17-00"},"Accesorios de impuestos",null,{"$f":"SUM(D14:D18)","v":0},{"$f":"SUM(E14:E18)","v":0},0]
[{"v":1701,"d":"17-01"},null,"Recargos",{"$f":"'CRI-M'!O14","v":0},null,0]
[{"v":1702,"d":"17-02"},null,"Actualizaciones",{"$f":"'CRI-M'!O15","v":0},null,0]
[{"v":1703,"d":"17-03"},null,"Multas",{"$f":"'CRI-M'!O16","v":0},null,0]
[{"v":1704,"d":"17-04"},null,"Gastos de ejecución",{"$f":"'CRI-M'!O17","v":0},null,0]
[{"v":1709,"d":"17-09"},null,"Otros no especificados",{"$f":"'CRI-M'!O18","v":0},null,0]
[{"v":1800,"d":"18-00"},"Otros impuestos",null,{"$f":"SUM(D20)","v":0},{"$f":"SUM(E20)","v":0},0]
[{"v":1801,"d":"18-01"},null,"Otros impuestos",{"$f":"'CRI-M'!O20","v":0},null,0]
[{"v":2000,"d":"20-00"},"CUOTAS Y APORTACIONES DE SEGURIDAD SOCIAL",null,{"$f":"SUM(D22:D26)","v":0},{"$f":"SUM(E22:E26)","v":0},0]
[{"v":2100,"d":"21-00"},"Aportaciones para fondos de vivienda",{"$nulls":3},0]
[{"v":2200,"d":"22-00"},"Cuotas para la seguirdad social",{"$nulls":3},0]
[{"v":2300,"d":"23-00"},"Cuotas de ahorro para el retiro",{"$nulls":3},0]
[{"v":2400,"d":"24-00"},"Otras cuotas y aportaciones para la seguirdad social",{"$nulls":3},0]
[{"v":2500,"d":"25-00"},"Accesorios de cuotas y aportaciones de seguirdad social",{"$nulls":3},0]
[{"v":3000,"d":"30-00"},"CONTRIBUCIONES DE MEJORAS",null,{"$f":"SUM(D28)","v":0},{"$f":"SUM(E28)","v":0},0]
[{"v":3100,"d":"31-00"},"Contribuciones de mejoras por obras públicas",null,{"$f":"SUM(D29)","v":0},{"$f":"SUM(E29)","v":0},0]
[{"v":3101,"d":"31-01"},null,"Contribuciones de mejoras por obras públicas",{"$f":"'CRI-M'!O29","v":0},null,0]
[{"v":4000,"d":"40-00"},"DERECHOS",null,{"$f":"D31+D36+D37+D52+D54","v":0},{"$f":"E31+E36+E37+E52+E54","v":0},0]
[{"v":4100,"d":"41-00"},"Derechos por el uso, goce, aprovechamiento o explotación de bienes de dominio público",null,{"$f":"SUM(D32:D35)","v":0},{"$f":"SUM(E32:E35)","v":0},0]
[{"v":4101,"d":"41-01"},null,"Derechos por el uso del piso",{"$f":"'CRI-M'!O32","v":0},null,0]
[{"v":4102,"d":"41-02"},null,"Derechos por el uso de los estacionamientos",{"$f":"'CRI-M'!O33","v":0},null,0]
[{"v":4103,"d":"41-03"},null,"Derechos de uso de cementerios y panteones municipales",{"$f":"'CRI-M'!O34","v":0},null,0]
[{"v":4104,"d":"41-04"},null,"Derechos de concesiones y demas inmuebles de propiedad municipal",{"$f":"'CRI-M'!O35","v":0},null,0]
[{"v":4200,"d":"42-00"},"Derechos a los hidrocarburos (Derogado)",{"$nulls":3},0]
[{"v":4300,"d":"43-00"},"Derechos por prestación de servicios",null,{"$f":"SUM(D38:D51)","v":0},{"$f":"SUM(E38:E51)","v":0},0]
["43-01",null,"Derechos de licencias y permisos de giros",{"$f":"'CRI-M'!O38","v":0},null,0]
["43-02",null,"Derechos de licencias y permisos de anuncios",{"$f":"'CRI-M'!O39","v":0},null,0]
[{"v":4303,"d":"43-03"},null,"Derechos de licencias de construcción, reconstrucción, reparación o demolición de obras",{"$f":"'CRI-M'!O40","v":0},null,0]
[{"v":4304,"d":"43-04"},null,"Derechos de regularizaciones de los registros de obra",{"$f":"'CRI-M'!O41","v":0},null,0]
[{"v":4305,"d":"43-05"},null,"Derechos de alineamiento, designación de número oficial e inspección",{"$f":"'CRI-M'!O42","v":0},null,0]
[{"v":4306,"d":"43-06"},null,"Derechos de licencias de cambio de régimen de propiedad y urbanización",{"$f":"'CRI-M'!O43","v":0},null,0]
[{"v":4307,"d":"43-07"},null,"Derechos de servicios de obra",{"$f":"'CRI-M'!O44","v":0},null,0]
[{"v":4308,"d":"43-08"},null,"Derechos de servicios de sanidad",{"$f":"'CRI-M'!O45","v":0},null,0]
[{"v":4309,"d":"43-09"},null,"Derechos de servicio de limpieza, recolección, traslado, tratamiento y disposición final de residuos",{"$f":"'CRI-M'!O46","v":0},null,0]
[{"v":4310,"d":"43-10"},null,"Derechos de agua potable, drenaje, alcantarillado, tratamiento y disposición final de aguas residuales",{"$f":"'CRI-M'!O47","v":0},null,0]
[{"v":4311,"d":"43-11"},null,"Derechos del rastro",{"$f":"'CRI-M'!O48","v":0},null,0]
[{"v":4312,"d":"43-12"},null,"Derechos del registro civil",{"$f":"'CRI-M'!O49","v":0},null,0]
[{"v":4313,"d":"43-13"},null,"Derechos de las certificaciones",{"$f":"'CRI-M'!O50","v":0},null,0]
[{"v":4314,"d":"43-14"},null,"Derechos de los servicios de catastro",{"$f":"'CRI-M'!O51","v":0},null,0]
[{"v":4400,"d":"44-00"},"Otros derechos",null,{"$f":"SUM(D53)","v":0},{"$f":"SUM(E53)","v":0},0]
[{"v":4401,"d":"44-01"},null,"Otros derechos",{"$f":"'CRI-M'!O53","v":0},null,0]
[{"v":4500,"d":"45-00"},"Accesorios de derechos",null,{"$f":"SUM(D55:D59)","v":0},{"$f":"SUM(E55:E59)","v":0},0]
[{"v":4501,"d":"45-01"},null,"Recargos",{"$f":"'CRI-M'!O55","v":0},null,0]
[{"v":4502,"d":"45-02"},null,"Actualizaciones",{"$f":"'CRI-M'!O56","v":0},null,0]
[{"v":4503,"d":"45-03"},null,"Multas",{"$f":"'CRI-M'!O57","v":0},null,0]
[{"v":4504,"d":"45-04"},null,"Gastos de ejecución",{"$f":"'CRI-M'!O58","v":0},null,0]
[{"v":4509,"d":"45-09"},null,"Otros no especificados",{"$f":"'CRI-M'!O59","v":0},null,0]
[{"v":5000,"d":"50-00"},"PRODUCTOS",null,{"$f":"D61+D64","v":{"v":130343,"d":"130,343"}},{"$f":"E61+E64","v":0},{"v":130343,"d":"130,343"}]
[{"v":5100,"d":"51-00"},"Productos",null,{"$f":"SUM(D62:D63)","v":{"v":130343,"d":"130,343"}},{"$f":"SUM(E62:E63)","v":0},{"v":130343,"d":"130,343"}]
[{"v":5101,"d":"51-01"},null,"Uso, goce, aprovechamiento o explotación de bienes de dominio privado",{"$f":"'CRI-M'!O62","v":0},null,0]
[{"v":5102,"d":"51-02"},null,"Productos diversos",{"$f":"'CRI-M'!O63","v":{"v":130343,"d":"130,343"}},null,{"v":130343,"d":"130,343"}]
[{"v":5200,"d":"52-00"},"Productos de capital (Derogado)",{"$nulls":3},0]
[{"v":6000,"d":"60-00"},"APROVECHAMIENTOS",null,{"$f":"D66+D70+D73","v":0},{"$f":"E66+E70+E73","v":0},0]
[{"v":6100,"d":"61-00"},"Aprovechamientos",null,{"$f":"SUM(D67:D69)","v":0},{"$f":"SUM(E67:E69)","v":0},0]
[{"v":6101,"d":"61-01"},null,"Aprovechamientos de las sanciones, multas, honorarios y donativos",{"$f":"'CRI-M'!O67","v":0},null,{"$f":"D67+E67","v":0}]
[{"v":6102,"d":"61-02"},null,"Aprovechamientos de las indemnizaciones a favor del municipio",{"$f":"'CRI-M'!O68","v":0},null,0]
[{"v":6103,"d":"61-03"},null,"Otros aprovechamientos",{"$f":"'CRI-M'!O69","v":0},null,0]
[{"v":6200,"d":"62-00"},"Aprovechamientos patrimoniales",null,{"$f":"SUM(D71:D72)","v":0},{"$f":"SUM(E71:E72)","v":0},0]
["62-01",null,"Aprovechamientos por el uso o enajenación de bienes",{"$f":"'CRI-M'!O71","v":0},null,0]
[{"v":6202,"d":"62-02"},null,"Aporvechamientos por recuperación de capital o patrimonio invertido",{"$f":"'CRI-M'!O72","v":0},null,0]
[{"v":6300,"d":"63-00"},"Accesorios de aprovechamientos",null,{"$f":"SUM(D74:D78)","v":0},{"$f":"SUM(E74:E78)","v":0},0]
[{"v":6301,"d":"63-01"},null,"Recargos",{"$f":"'CRI-M'!O74","v":0},null,0]
[{"v":6302,"d":"63-02"},null,"Actualizaciones",{"$f":"'CRI-M'!O75","v":0},null,0]
[{"v":6303,"d":"63-03"},null,"Multas",{"$f":"'CRI-M'!O76","v":0},null,0]
[{"v":6304,"d":"63-04"},null,"Gastos de ejecución",{"$f":"'CRI-M'!O77","v":0},null,0]
[{"v":6309,"d":"63-09"},null,"Otros no especificados",{"$f":"'CRI-M'!O78","v":0},null,0]
[{"v":7000,"d":"70-00"},"INGRESOS POR VENTAS DE BIENES, PRESTACIÓN DE SERVICIOS Y OTROS INGRESOS",null,{"$f":"D80+D82+D83+D85+D86+D87+D88+D90+D91","v":0},{"$f":"E80+E82+E83+E85+E86+E87+E88+E90+E91","v":0},0]
[{"v":7100,"d":"71-00"},"Ingresos por venta de bienes y prestación de servicios de instituciones públicas de seguridad social",null,{"$f":"SUM(D81)","v":0},{"$f":"SUM(E81)","v":0},0]
[{"v":7101,"d":"71-01"},null,"Ingresos por venta de bienes y prestación de servicios de instituciones públicas de seguridad social",{"$f":"'CRI-M'!O81","v":0},null,0]
[{"v":7200,"d":"72-00"},"Ingresos por venta de bienes y prestación de servicios de empresas productivas del estado",{"$nulls":3},0]
[{"v":7300,"d":"73-00"},"Ingresos por venta de bienes y prestación de servicios de entidades paraestatales y fideicomisos no empresariales y no financieros",null,{"$f":"SUM(D84)","v":0},{"$f":"SUM(E84)","v":0},0]
[{"v":7301,"d":"73-01"},null,"Ingresos por venta de bienes y prestación de servicios de entidades paraestatales y fideicomisos no empresariales y no financieros",{"$f":"'CRI-M'!O84","v":0},null,0]
[{"v":7400,"d":"74-00"},"Ingresos por venta de bienes y prestación de servicios de entidades paraestatales empresariales no financieras con participación estatal mayoritaria",{"$nulls":3},0]
[{"v":7500,"d":"75-00"},"Ingresos por venta de bienes y prestación de servicios de entidades paraestatales empresariales financieras monetarias con participación estatal mayoritaria",{"$nulls":3},0]
[{"v":7600,"d":"76-00"},"Ingresos por venta de bienes y prestación de servicios de entidades paraestatales empresariales financieras no monetarias con participación estatal mayoritaria",{"$nulls":3},0]
[{"v":7700,"d":"77-00"},"Ingresos por venta de bienes y prestación de servicios de fideicomisos financieros públicos con participación estatal mayoritaria",null,{"$f":"SUM(D89)","v":0},{"$f":"SUM(E89)","v":0},0]
[{"v":7701,"d":"77-01"},null,"Ingresos por venta de bienes y prestación de servicios de fideicomisos financieros públicos con participación estatal mayoritaria",{"$f":"'CRI-M'!O89","v":0},null,0]
[{"v":7800,"d":"78-00"},"Ingresos por venta de bienes y prestación de servicios de los poderes legislativo y judicial, y de los órganos autónomos",{"$nulls":3},0]
[{"v":7900,"d":"79-00"},"Otros ingresos",null,{"$f":"SUM(D92)","v":0},{"$f":"SUM(E92)","v":0},0]
[{"v":7901,"d":"79-01"},null,"Otros ingresos",{"$f":"'CRI-M'!O92","v":0},null,0]
[{"v":8000,"d":"80-00"},"PARTICIPACIONES, APORTACIONES, CONVENIOS, INCENTIVOS DERIVADOS DE LA COLABORACIÓN FISCAL Y FONDOS DISTINTOS DE LAS APORTACIONES",null,{"$f":"D94+D107+D110+D115+D121","v":0},{"$f":"E94+E107+E110+E115+E121","v":0},0]
[{"v":8100,"d":"81-00"},"Participaciones",null,{"$f":"SUM(D95:D106)","v":0},{"$f":"SUM(E95:E106)","v":0},0]
[{"v":8101,"d":"81-01"},null,"Fondo general de participaciones (federal)",{"$f":"'CRI-M'!O95","v":0},null,0]
[{"v":8102,"d":"81-02"},null,"Fondo de fomento municipal (federal)",{"$f":"'CRI-M'!O96","v":0},null,0]
[{"v":8103,"d":"81-03"},null,"Fondo de fiscalización y recaudación (federal)",{"$f":"'CRI-M'!O97","v":0},null,0]
[{"v":8104,"d":"81-04"},null,"Fondo de compensación (federal)",{"$f":"'CRI-M'!O98","v":0},null,0]
[{"v":8105,"d":"81-05"},null,"Fondo de extracción de hidrocarburos (federal)",{"$f":"'CRI-M'!O99","v":0},null,0]
[{"v":8106,"d":"81-06"},null,"Impuesto especial sobre producción y servicios (federal)",{"$f":"'CRI-M'!O100","v":0},null,0]
[{"v":8107,"d":"81-07"},null,"0.136% de la recaudación federal participable (federal)",{"$f":"'CRI-M'!O101","v":0},null,0]
[{"v":8108,"d":"81-08"},null,"3.17% sobre extracción de petróleo (federal)",{"$f":"'CRI-M'!O102","v":0},null,0]
[{"v":8109,"d":"81-09"},null,"Gasolinas y diésel (federal)",{"$f":"'CRI-M'!O103","v":0},null,0]
[{"v":8110,"d":"81-10"},null,"Fondo del impuesto sobre la renta (federal)",{"$f":"'CRI-M'!O104","v":0},null,0]
[{"v":8111,"d":"81-11"},null,"Fondo de estabilización de los ingresos de las entidades federativas (federal)",{"$f":"'CRI-M'!O105","v":0},null,0]
[{"v":8112,"d":"81-12"},null,"Participaciones del estado",{"$f":"'CRI-M'!O106","v":0},null,0]
[{"v":8200,"d":"82-00"},"Aportaciones",null,{"$f":"SUM(D108:D109)","v":0},{"$f":"SUM(E108:E109)","v":0},0]
[{"v":8201,"d":"82-01"},null,"Fondo de aportaciones para la infraestructura social municipal",null,{"$f":"'CRI-M'!O108","v":0},0]
[{"v":8202,"d":"82-02"},null,"Fondo de aportaciones para el fortalecimiento municipal",null,{"$f":"'CRI-M'!O109","v":0},0]
[{"v":8300,"d":"83-00"},"Convenios",null,{"$f":"SUM(D111:D114)","v":0},{"$f":"SUM(E111:E114)","v":0},0]
[{"v":8301,"d":"83-01"},null,"Convenios de protección social en salud",null,{"$f":"'CRI-M'!O111","v":0},0]
[{"v":8302,"d":"83-02"},null,"Convenios de descentralizados",null,{"$f":"'CRI-M'!O112","v":0},0]
[{"v":8303,"d":"83-03"},null,"Convenio de reasignación",null,{"$f":"'CRI-M'!O113","v":0},0]
[{"v":8304,"d":"83-04"},null,"Otros convenios y subsidios",{"$f":"'CRI-M'!O114","v":0},{"$f":"'CRI-M'!O115+'CRI-M'!O116","v":0},0]
[{"v":8400,"d":"84-00"},"Incentivos derivados de la colaboración fiscal",null,{"$f":"SUM(D116:D120)","v":0},{"$f":"SUM(E116:E120)","v":0},0]
[{"v":8401,"d":"84-01"},null,"Tenencia o uso de vehículos",{"$f":"'CRI-M'!O118","v":0},null,0]
[{"v":8402,"d":"84-02"},null,"Fondo de compensación ISAN",{"$f":"'CRI-M'!O119","v":0},null,0]
[{"v":8403,"d":"84-03"},null,"Impuesto sobre automóviles nuevos",{"$f":"'CRI-M'!O120","v":0},null,0]
[{"v":8404,"d":"84-04"},null,"Fondo de compensación de repecos-intermedios",{"$f":"'CRI-M'!O121","v":0},null,0]
[{"v":8405,"d":"84-05"},null,"Otros incentivos económicos",{"$f":"'CRI-M'!O122","v":0},null,0]
[{"v":8500,"d":"85-00"},"Fondos distintos de aportaciones",null,{"$f":"SUM(D122:D123)","v":0},{"$f":"SUM(E122:E123)","v":0},0]
[{"v":8501,"d":"85-01"},null,"Fondo para entidades federativas y municipios productores de hidrocarburos",null,{"$f":"'CRI-M'!O124","v":0},0]
[{"v":8502,"d":"85-02"},null,"Fondo minero",null,{"$f":"'CRI-M'!O125","v":0},0]
[{"v":9000,"d":"90-00"},"TRANSFERENCIAS, ASIGNACIONES, SUBSIDIOS Y SUBVENCIONES Y PENSIONES Y JUBILACIONES",null,{"$f":"D125+D127+D128+D130+D131+D133+D134","v":{"v":2074788,"d":"2,074,788"}},{"$f":"E125+E127+E128+E130+E131+E133+E134","v":0},{"v":2074788,"d":"2,074,788"}]
[{"v":9100,"d":"91-00"},"Transferencias y asignaciones",null,{"$f":"SUM(D126)","v":0},{"$f":"SUM(E126)","v":0},0]
[{"v":9101,"d":"91-01"},null,"Transferencias y asignaciones",{"$f":"'CRI-M'!O128","v":0},{"$f":"'CRI-M'!O129","v":0},0]
[{"v":9200,"d":"92-00"},"Transferencias al resto del sector público (derogado)",{"$nulls":3},0]
[{"v":9300,"d":"93-00"},"Subsidios y subvenciones",null,{"$f":"SUM(D129)","v":{"v":2074788,"d":"2,074,788"}},{"$f":"SUM(E129)","v":0},{"v":2074788,"d":"2,074,788"}]
[{"v":9301,"d":"93-01"},null,"Subsidios y subvenciones",{"$f":"'CRI-M'!O132","v":{"v":2074788,"d":"2,074,788"}},{"$f":"'CRI-M'!O133","v":0},{"v":2074788,"d":"2,074,788"}]
[{"v":9400,"d":"94-00"},"Ayudas sociales (derogado)",{"$nulls":3},0]
[{"v":9500,"d":"95-00"},"Pensiones y juvilaciones",null,{"$f":"SUM(D132)","v":0},{"$f":"SUM(E132)","v":0},{"$f":"D131+E131","v":0}]
[{"v":9501,"d":"95-01"},null,"Pensiones y juvilaciones",{"$f":"'CRI-M'!O136","v":0},null,0]
[{"v":9600,"d":"96-00"},"Transferencias a fideicomisos, mandatos y análogos (derogado)",{"$nulls":3},0]
[{"v":9700,"d":"97-00"},"Transferencias del fondo mexicano del petróleo para la estabilización y el desarrollo",null,{"$f":"SUM(D135)","v":0},{"$f":"SUM(E135)","v":0},0]
["97-01",null,"Transferencias del fondo mexicano del petróleo para la estabilización y el desarrollo",{"$f":"'CRI-M'!O139","v":0},null,0]
[{"v":0,"d":"00-00"},"INGRESOS DERIVADOS DE FINANCIAMIENTO",null,{"$f":"D137+D138+D139","v":0},{"$f":"E137+E138+E139","v":0},0]
[{"v":100,"d":"01-00"},"Endeudamiento interno",{"$nulls":3},0]
[{"v":200,"d":"02-00"},"Endeudamiento externo",{"$nulls":3},0]
[{"v":300,"d":"03-00"},"Financiamiento interno",null,{"$f":"SUM(D140)","v":0},{"$f":"SUM(E140)","v":0},0]
[{"v":301,"d":"03-01"},null,"Financiamiento interno",null,{"$f":"'CRI-M'!O144","v":0},0]
["ESTIMACIÓN DE INGRESOS",null,null,{"$f":"D2+D21+D27+D30+D60+D65+D79+D93+D124+D136","v":{"v":2205131,"d":"2,205,131"}},{"$f":"E2+E21+E27+E30+E60+E65+E79+E93+E124+E136","v":0},{"$f":"F2+F21+F27+F30+F60+F65+F79+F93+F124+F136","v":{"v":2205131,"d":"2,205,131"}}]

{"sheet":"COG-RYP","index":7,"n_rows":160,"n_cols":8,"rows_kept":160}
[null,"Resultado\n2017","Resultado\n2018","Resultado\n2019","Presupuesto\n2020","Proyección\n2021","Proyección\n2022","Proyección\n2023"]
["GASTOS NO ETIQUETADO"]
["Servicios personales",{"v":1311250,"d":"1,311,250"},{"v":1386015,"d":"1,386,015"},{"v":1455317,"d":"1,455,317"},{"$f":"SUM('COG-FF'!C3:I3)","v":{"v":1490399,"d":"1,490,399"}},{"v":1564919,"d":"1,564,919"},{"v":1643165,"d":"1,643,165"},{"v":1692460,"d":"1,692,460"}]
["Materiales y suministros",{"v":334139,"d":"334,139"},{"v":344824,"d":"344,824"},{"v":361442,"d":"361,442"},{"$f":"SUM('COG-FF'!C40:I40)","v":{"v":370128,"d":"370,128"}},{"v":388634,"d":"388,634"},{"v":408066,"d":"408,066"},{"v":420308,"d":"420,308"}]
["Servicios generales",{"v":226200,"d":"226,200"},{"v":237510,"d":"237,510"},{"v":249386,"d":"249,386"},{"$f":"SUM('COG-FF'!C105:I105)","v":{"v":255372,"d":"255,372"}},{"v":268140,"d":"268,140"},{"v":295624,"d":"295,624"},{"v":304493,"d":"304,493"}]
["Transferencias, asignaciones, subsidios y otras ayudas",{"v":62433,"d":"62,433"},{"v":64934,"d":"64,934"},{"v":68181,"d":"68,181"},{"$f":"SUM('COG-FF'!C190:I190)","v":{"v":69816,"d":"69,816"}},{"v":73307,"d":"73,307"},{"v":76972,"d":"76,972"},{"v":79281,"d":"79,281"}]
["Bienes muebles, inmuebles e intangibles",{"v":17204,"d":"17,204"},{"v":18064,"d":"18,064"},{"v":18967,"d":"18,967"},{"$f":"SUM('COG-FF'!C250:I250)","v":{"v":19416,"d":"19,416"}},{"v":20387,"d":"20,387"},{"v":21406,"d":"21,406"},{"v":22048,"d":"22,048"}]
["Inversion pública",{"$nulls":3},{"$f":"SUM('COG-FF'!C309:I309)","v":0}]
["Inversiones financieras y otras provisiones",{"$nulls":3},{"$f":"SUM('COG-FF'!C331:I331)","v":0}]
["Participaciones y aportaciones",{"$nulls":3},{"$f":"SUM('COG-FF'!C379:I379)","v":0}]
["Deuda pública",{"$nulls":3},{"$f":"SUM('COG-FF'!C397:I397)","v":0}]
["Total de gasto no etiquetado",{"$f":"SUM(B3:B11)","v":{"v":1951226,"d":"1,951,226"}},{"v":2051347,"d":"2,051,347"},{"v":2153293,"d":"2,153,293"},{"v":2205131,"d":"2,205,131"},{"v":2315387,"d":"2,315,387"},{"v":2445233,"d":"2,445,233"},{"v":2518590,"d":"2,518,590"}]
["GASTO ETIQUETADO"]
["Servicios personales",{"$nulls":3},{"$f":"SUM('COG-FF'!J3:L3)","v":0}]
["Materiales y suministros",{"$nulls":3},{"$f":"SUM('COG-FF'!J40:L40)","v":0}]
["Servicios generales",{"$nulls":3},{"$f":"SUM('COG-FF'!J105:L105)","v":0}]
["Transferencias, asignaciones, subsidios y otras ayudas",{"$nulls":3},{"$f":"SUM('COG-FF'!J190:L190)","v":0}]
["Bienes muebles, inmuebles e intangibles",{"$nulls":3},{"$f":"SUM('COG-FF'!J250:L250)","v":0}]
["Inversion pública",{"$nulls":3},{"$f":"SUM('COG-FF'!J309:L309)","v":0}]
["Inversiones financieras y otras provisiones",{"$nulls":3},{"$f":"SUM('COG-FF'!J331:L331)","v":0}]
["Participaciones y aportaciones",{"$nulls":3},{"$f":"SUM('COG-FF'!J379:L379)","v":0}]
["Deuda pública",{"$nulls":3},{"$f":"SUM('COG-FF'!J397:L397)","v":0}]
["Total de gasto etiquetado",{"$f":"SUM(B14:B22)","v":0},0,0,0,0,0,0]
["TOTAL DE EGRESOS",{"$f":"B12+B23","v":{"v":1951226,"d":"1,951,226"}},{"$f":"C12+C23","v":{"v":2051347,"d":"2,051,347"}},{"v":2153293,"d":"2,153,293"},{"v":2205131,"d":"2,205,131"},{"v":2315387,"d":"2,315,387"},{"v":2445233,"d":"2,445,233"},{"v":2518590,"d":"2,518,590"}]
{"$rows_empty":135}
[null,{"$f":"SUM(B24:H24)","v":{"v":15640207,"d":"15,640,207"}}]

{"sheet":"COG-FF","index":8,"n_rows":429,"n_cols":13,"rows_kept":429,"merged":[[0,0,1,0],[0,1,1,1],[0,2,0,8],[0,9,0,11],[0,12,1,12]]}
["COG-FF","DESCRIPCIÓN","1.  NO ETIQUETADO",{"$nulls":6},"2.  ETIQUETADO",null,null,"TOTAL ANUAL"]
[null,null,"11\nRECURSOS FISCALES","12\nFINANCIAMIENTOS INTERNOS","13\nFINANCIAMIENTOS EXTERNOS","14\nINGRESOS \nPROPIOS","15\nRECURSOS\nFEDERALES","16\nRECURSOS\nESTATALES","17\nOTROS RECURSOS DE LIBRE DISPOSICIÓN","25 \nRECURSOS FEDERALES","26\nRECURSOS\nESTATALES","27\nOTROS RECURSOS DE TRANSFERENCIAS FEDERALES ETIQUETADAS"]
[1000,"SERVICIOS PERSONALES",{"$f":"C4+C9+C14+C23+C28+C35+C37","v":{"v":1490399,"d":"1,490,399"}},0,0,0,0,0,0,0,0,0,{"$f":"M4+M9+M14+M23+M28+M35+M37","v":{"v":1490399,"d":"1,490,399"}}]
[1100,"REMUNERACIONES AL PERSONAL DE CARÁCTER PERMANENTE",{"$f":"SUM(C5:C8)","v":{"v":1180032,"d":"1,180,032"}},0,0,0,0,0,0,{"$f":"SUM(J5:J8)","v":0},{"$f":"SUM(K5:K8)","v":0},{"$f":"SUM(L5:L8)","v":0},{"$f":"SUM(M5:M8)","v":{"v":1180032,"d":"1,180,032"}}]
[111,"Dietas",{"$f":"'COG-M'!P4","v":0},{"$nulls":3},{"$f":"'COG-M'!P5","v":0},{"$f":"'COG-M'!P6","v":0},{"$f":"'COG-M'!P7","v":0},{"$nulls":3},{"$f":"SUM(C5:L5)","v":0}]
[112,"Haberes",{"$nulls":10},{"$f":"SUM(C6:L6)","v":0}]
[113,"Sueldos base al personal permanente",{"$f":"'COG-M'!P9","v":{"v":1180032,"d":"1,180,032"}},null,null,{"$f":"'COG-M'!P10","v":0},{"$f":"'COG-M'!P11","v":0},{"$f":"'COG-M'!P12","v":0},{"$f":"'COG-M'!P13","v":0},{"$f":"'COG-M'!P14","v":0},null,null,{"$f":"SUM(C7:L7)","v":{"v":1180032,"d":"1,180,032"}}]
[114,"Remuneraciones por adscripción laboral en el extranjero",{"$f":"'COG-M'!P15","v":0},{"$nulls":3},{"$f":"'COG-M'!P16","v":0},{"$f":"'COG-M'!P17","v":0},{"$f":"'COG-M'!P18","v":0},{"$nulls":3},{"$f":"SUM(C8:L8)","v":0}]
[1200,"REMUNERACIONES AL PERSONAL DE CARÁCTER TRANSITORIO",{"$f":"SUM(C10:C13)","v":{"v":11903,"d":"11,903"}},{"$f":"SUM(D10:D13)","v":0},0,0,0,0,0,0,0,0,{"v":11903,"d":"11,903"}]
[121,"Honorarios asimilables a salarios",{"$f":"'COG-M'!P20","v":0},null,null,{"$f":"'COG-M'!P21","v":0},{"$f":"'COG-M'!P22","v":0},{"$f":"'COG-M'!P23","v":0},{"$f":"'COG-M'!P24","v":0},{"$nulls":3},{"$f":"SUM(C10:L10)","v":0}]
[122,"Sueldos base al personal eventual",{"$f":"'COG-M'!P25","v":{"v":11903,"d":"11,903"}},null,null,{"$f":"'COG-M'!P26","v":0},{"$f":"'COG-M'!P27","v":0},{"$f":"'COG-M'!P28","v":0},{"$f":"'COG-M'!P29","v":0},{"$f":"'COG-M'!P30","v":0},{"$f":"'COG-M'!P31","v":0},{"$f":"'COG-M'!P32","v":0},{"$f":"SUM(C11:L11)","v":{"v":11903,"d":"11,903"}}]
[123,"Retribuciones por servicios de carácter social",{"$f":"'COG-M'!P33","v":0},null,null,{"$f":"'COG-M'!P34","v":0},{"$f":"'COG-M'!P35","v":0},{"$f":"'COG-M'!P36","v":0},{"$f":"'COG-M'!P37","v":0},{"$nulls":3},{"$f":"SUM(C12:L12)","v":0}]
[124,"Retribución a los representantes de los trabajadores y de los patrones en la Junta de Conciliación y Arbitraje",{"$nulls":10},{"$f":"SUM(C13:L13)","v":0}]
[1300,"REMUNERACIONES ADICIONALES Y ESPECIALES",{"$f":"SUM(C15:C22)","v":{"v":177912,"d":"177,912"}},0,0,0,0,0,0,0,0,0,{"v":177912,"d":"177,912"}]
[131,"Primas por años de servicios efectivos prestados",{"$f":"'COG-M'!P40","v":0},null,null,{"$f":"'COG-M'!P41","v":0},{"$f":"'COG-M'!P42","v":0},{"$f":"'COG-M'!P43","v":0},{"$f":"'COG-M'!P44","v":0},{"$nulls":3},{"$f":"SUM(C15:L15)","v":0}]
[132,"Primas de vacaciones, dominical y gratificación de fin de año",{"$f":"'COG-M'!P45","v":{"v":177912,"d":"177,912"}},null,null,{"$f":"'COG-M'!P46","v":0},{"$f":"'COG-M'!P47","v":0},{"$f":"'COG-M'!P48","v":0},{"$f":"'COG-M'!P49","v":0},{"$f":"'COG-M'!P50","v":0},null,null,{"v":177912,"d":"177,912"}]
[133,"Horas extraordinarias",{"$f":"'COG-M'!P51","v":0},null,null,{"$f":"'COG-M'!P52","v":0},{"$f":"'COG-M'!P53","v":0},{"$f":"'COG-M'!P54","v":0},{"$f":"'COG-M'!P55","v":0},{"$f":"'COG-M'!P56","v":0},null,null,0]
[134,"Compensaciones",{"$f":"'COG-M'!P57","v":0},null,null,{"$f":"'COG-M'!P58","v":0},{"$f":"'COG-M'!P59","v":0},{"$f":"'COG-M'!P60","v":0},{"$f":"'COG-M'!P61","v":0},{"$f":"'COG-M'!P62","v":0},null,null,0]
[135,"Sobrehaberes",{"$nulls":10},0]
[136,"Asignaciones de técnico, de mando, por comisión, de vuelo y de técnico especial",{"$nulls":10},0]
[137,"Honorarios especiales",{"$f":"'COG-M'!P65","v":0},null,null,{"$f":"'COG-M'!P66","v":0},{"$f":"'COG-M'!P67","v":0},{"$f":"'COG-M'!P68","v":0},{"$f":"'COG-M'!P69","v":0},{"$nulls":3},0]
[138,"Participaciones por vigilancia en el cumplimiento de la leyes y custodia de valores",{"$f":"'COG-M'!P70","v":0},null,null,{"$f":"'COG-M'!P71","v":0},{"$f":"'COG-M'!P72","v":0},{"$f":"'COG-M'!P73","v":0},{"$f":"'COG-M'!P74","v":0},{"$nulls":3},0]
[1400,"SEGURIDAD SOCIAL",{"$f":"SUM(C24:C27)","v":{"v":87000,"d":"87,000"}},0,0,0,0,0,0,0,0,0,{"v":87000,"d":"87,000"}]
[141,"Aportaciones de seguridad social",{"$f":"'COG-M'!P76","v":{"v":87000,"d":"87,000"}},null,null,{"$f":"'COG-M'!P77","v":0},{"$f":"'COG-M'!P78","v":0},{"$f":"'COG-M'!P79","v":0},{"$f":"'COG-M'!P80","v":0},{"$nulls":3},{"$f":"SUM(C24:L24)","v":{"v":87000,"d":"87,000"}}]
[142,"Aportaciones a fondos de vivienda",{"$f":"'COG-M'!P81","v":0},null,null,{"$f":"'COG-M'!P82","v":0},{"$f":"'COG-M'!P83","v":0},{"$f":"'COG-M'!P84","v":0},{"$f":"'COG-M'!P85","v":0},{"$nulls":3},{"$f":"SUM(C25:L25)","v":0}]
[143,"Aportaciones al sistema para el retiro",{"$f":"'COG-M'!P86","v":0},null,null,{"$f":"'COG-M'!P87","v":0},{"$f":"'COG-M'!P88","v":0},{"$f":"'COG-M'!P89","v":0},{"$f":"'COG-M'!P90","v":0},{"$nulls":3},{"$f":"SUM(C26:L26)","v":0}]
[144,"Aportaciones para seguros",{"$f":"'COG-M'!P91","v":0},null,null,{"$f":"'COG-M'!P92","v":0},{"$f":"'COG-M'!P93","v":0},{"$f":"'COG-M'!P94","v":0},{"$f":"'COG-M'!P95","v":0},{"$nulls":3},{"$f":"SUM(C27:L27)","v":0}]
[1500,"OTRAS PRESTACIONES SOCIALES Y ECONÓMICAS",{"$f":"SUM(C29:C34)","v":0},0,0,0,0,0,0,0,0,0,0]
[151,"Cuotas para el fondo de ahorro y fondo de trabajo",{"$f":"'COG-M'!P97","v":0},null,null,{"$f":"'COG-M'!P98","v":0},{"$f":"'COG-M'!P99","v":0},{"$f":"'COG-M'!P100","v":0},{"$f":"'COG-M'!P101","v":0},{"$f":"'COG-M'!P102","v":0},null,null,{"$f":"SUM(C29:L29)","v":0}]
[152,"Indemnizaciones",{"$f":"'COG-M'!P103","v":0},null,null,{"$f":"'COG-M'!P104","v":0},{"$f":"'COG-M'!P105","v":0},{"$f":"'COG-M'!P106","v":0},{"$f":"'COG-M'!P107","v":0},null,null,{"$f":"'COG-M'!P108","v":0},0]
[153,"Prestaciones y haberes de retiro",{"$f":"'COG-M'!P109","v":0},null,null,{"$f":"'COG-M'!P110","v":0},{"$f":"'COG-M'!P111","v":0},{"$f":"'COG-M'!P112","v":0},{"$f":"'COG-M'!P113","v":0},{"$nulls":3},0]
[154,"Prestaciones contractuales",{"$f":"'COG-M'!P114","v":0},null,null,{"$f":"'COG-M'!P115","v":0},{"$f":"'COG-M'!P116","v":0},{"$f":"'COG-M'!P117","v":0},{"$f":"'COG-M'!P118","v":0},{"$f":"'COG-M'!P119","v":0},null,null,0]
[155,"Apoyos a la capacitación de los servidores públicos",{"$f":"'COG-M'!P120","v":0},null,null,{"$f":"'COG-M'!P121","v":0},{"$f":"'COG-M'!P122","v":0},{"$f":"'COG-M'!P123","v":0},{"$f":"'COG-M'!P124","v":0},{"$nulls":3},0]
[159,"Otras prestaciones sociales y económicas",{"$f":"'COG-M'!P125","v":0},null,null,{"$f":"'COG-M'!P126","v":0},{"$f":"'COG-M'!P127","v":0},{"$f":"'COG-M'!P128","v":0},{"$f":"'COG-M'!P129","v":0},{"$nulls":3},0]
[1600,"PREVISIONES",{"$f":"SUM(C36)","v":{"v":33552,"d":"33,552"}},0,0,0,0,0,0,0,0,0,{"v":33552,"d":"33,552"}]
[161,"Previsiones de carácter laboral, económica y de seguridad social",{"$f":"'COG-M'!P131","v":{"v":33552,"d":"33,552"}},null,null,{"$f":"'COG-M'!P132","v":0},{"$f":"'COG-M'!P133","v":0},{"$f":"'COG-M'!P134","v":0},{"$f":"'COG-M'!P135","v":0},{"$f":"'COG-M'!P136","v":0},null,null,{"$f":"SUM(C36:L36)","v":{"v":33552,"d":"33,552"}}]
[1700,"PAGO DE ESTÍMULOS A SERVIDORES PÚBLICOS",{"$f":"SUM(C38:C39)","v":0},0,0,0,0,0,0,0,0,0,0]
[171,"Estímulos",{"$f":"'COG-M'!P138","v":0},null,null,{"$f":"'COG-M'!P139","v":0},{"$f":"'COG-M'!P140","v":0},{"$f":"'COG-M'!P141","v":0},{"$f":"'COG-M'!P142","v":0},{"$nulls":3},{"$f":"SUM(C38:L38)","v":0}]
[172,"Recompensas",{"$f":"'COG-M'!P143","v":0},null,null,{"$f":"'COG-M'!P144","v":0},{"$f":"'COG-M'!P145","v":0},{"$f":"'COG-M'!P146","v":0},{"$f":"'COG-M'!P147","v":0},{"$nulls":3},{"$f":"SUM(C39:L39)","v":0}]
[2000,"MATERIALES Y SUMINISTROS",{"$f":"C41+C50+C54+C64+C74+C82+C85+C91+C95","v":{"v":370128,"d":"370,128"}},0,0,0,0,0,0,{"$f":"J41+J50+J54+J64+J74+J82+J85+J91+J95","v":0},{"$f":"K41+K50+K54+K64+K74+K82+K85+K91+K95","v":0},{"$f":"L41+L50+L54+L64+L74+L82+L85+L91+L95","v":0},{"$f":"M41+M50+M54+M64+M74+M82+M85+M91+M95","v":{"v":370128,"d":"370,128"}}]
[2100,"MATERIALES DE ADMINISTRACIÓN, EMISIÓN DE DOCUMENTOS Y ARTÍCULOS OFICIALES",{"$f":"SUM(C42:C49)","v":{"v":42840,"d":"42,840"}},0,0,0,0,0,0,{"$f":"SUM(J42:J49)","v":0},{"$f":"SUM(K42:K49)","v":0},{"$f":"SUM(L42:L49)","v":0},{"$f":"SUM(M42:M49)","v":{"v":42840,"d":"42,840"}}]
[211,"Materiales, útiles y equipos menores de oficina",{"$f":"'COG-M'!P150","v":{"v":28560,"d":"28,560"}},null,null,{"$f":"'COG-M'!P151","v":0},{"$f":"'COG-M'!P152","v":0},{"$f":"'COG-M'!P153","v":0},{"$f":"'COG-M'!P154","v":0},{"$nulls":3},{"$f":"SUM(C42:L42)","v":{"v":28560,"d":"28,560"}}]
[212,"Materiales y útiles de impresión y reproducción",{"$f":"'COG-M'!P155","v":{"v":7140,"d":"7,140"}},null,null,{"$f":"'COG-M'!P156","v":0},{"$f":"'COG-M'!P157","v":0},{"$f":"'COG-M'!P158","v":0},{"$f":"'COG-M'!P159","v":0},{"$nulls":3},{"v":7140,"d":"7,140"}]
[213,"Material estadístico y geográfico",{"$f":"'COG-M'!P160","v":0},null,null,{"$f":"'COG-M'!P161","v":0},{"$f":"'COG-M'!P162","v":0},{"$f":"'COG-M'!P163","v":0},{"$f":"'COG-M'!P164","v":0},{"$nulls":3},0]
[214,"Materiales, útiles y equipos menores de tecnologías de la información y comunicaciones",{"$f":"'COG-M'!P165","v":0},null,null,{"$f":"'COG-M'!P166","v":0},{"$f":"'COG-M'!P167","v":0},{"$f":"'COG-M'!P168","v":0},{"$f":"'COG-M'!P169","v":0},{"$nulls":3},0]
[215,"Material impreso e información digital",{"$f":"'COG-M'!P170","v":0},null,null,{"$f":"'COG-M'!P171","v":0},{"$f":"'COG-M'!P172","v":0},{"$f":"'COG-M'!P173","v":0},{"$f":"'COG-M'!P174","v":0},{"$nulls":3},0]
[216,"Material de limpieza",{"$f":"'COG-M'!P175","v":{"v":7140,"d":"7,140"}},null,null,{"$f":"'COG-M'!P176","v":0},{"$f":"'COG-M'!P177","v":0},{"$f":"'COG-M'!P178","v":0},{"$f":"'COG-M'!P179","v":0},{"$nulls":3},{"v":7140,"d":"7,140"}]
[217,"Materiales y útiles de enseñanza",{"$f":"'COG-M'!P180","v":0},null,null,{"$f":"'COG-M'!P181","v":0},{"$f":"'COG-M'!P182","v":0},{"$f":"'COG-M'!P183","v":0},{"$f":"'COG-M'!P184","v":0},{"$nulls":3},0]
[218,"Materiales para el registro e identificación de bienes y personas",{"$f":"'COG-M'!P185","v":0},null,null,{"$f":"'COG-M'!P186","v":0},{"$f":"'COG-M'!P187","v":0},{"$f":"'COG-M'!P188","v":0},{"$f":"'COG-M'!P189","v":0},{"$nulls":3},0]
[2200,"ALIMENTOS Y UTENSILIOS",{"$f":"SUM(C51:C53)","v":{"v":139392,"d":"139,392"}},0,0,0,0,0,0,{"$f":"SUM(J51:J53)","v":0},{"$f":"SUM(K51:K53)","v":0},{"$f":"SUM(L51:L53)","v":0},{"$f":"SUM(M51:M53)","v":{"v":139392,"d":"139,392"}}]
[221,"Productos alimenticios para personas",{"$f":"'COG-M'!P191","v":{"v":132252,"d":"132,252"}},null,null,{"$f":"'COG-M'!P192","v":0},{"$f":"'COG-M'!P193","v":0},{"$f":"'COG-M'!P194","v":0},{"$f":"'COG-M'!P195","v":0},{"$f":"'COG-M'!P196","v":0},null,null,{"$f":"SUM(C51:L51)","v":{"v":132252,"d":"132,252"}}]
[222,"Productos alimenticios para animales",{"$f":"'COG-M'!P197","v":0},null,null,{"$f":"'COG-M'!P198","v":0},{"$f":"'COG-M'!P199","v":0},{"$f":"'COG-M'!P200","v":0},{"$f":"'COG-M'!P201","v":0},{"$nulls":3},{"$f":"SUM(C52:L52)","v":0}]
[223,"Utensilios para el servicio de alimentación",{"$f":"'COG-M'!P202","v":{"v":7140,"d":"7,140"}},null,null,{"$f":"'COG-M'!P203","v":0},{"$f":"'COG-M'!P204","v":0},{"$f":"'COG-M'!P205","v":0},{"$f":"'COG-M'!P206","v":0},{"$nulls":3},{"$f":"SUM(C53:L53)","v":{"v":7140,"d":"7,140"}}]
[2300,"MATERIAS PRIMAS Y MATERIALES DE PRODUCCIÓN Y COMERCIALIZACIÓN",{"$f":"SUM(C55:C63)","v":0},0,0,0,0,0,0,{"$f":"SUM(J55:J63)","v":0},{"$f":"SUM(K55:K63)","v":0},{"$f":"SUM(L55:L63)","v":0},{"$f":"SUM(M55:M63)","v":0}]
[231,"Productos alimenticios, agropecuarios y forestales adquiridos como materia prima",{"$nulls":10},{"$f":"SUM(C55:L55)","v":0}]
[232,"Insumos textiles adquiridos como materia prima",{"$nulls":10},0]
[233,"Productos de papel, cartón e impresos adquiridos como materia prima",{"$nulls":10},0]
[234,"Combustibles, lubricantes, aditivos, carbón y sus derivados adquiridos como materia prima",{"$nulls":10},0]
[235,"Productos químicos, farmacéuticos y de laboratorio adquiridos como materia prima",{"$nulls":10},0]
[236,"Productos metálicos y a base de minerales no metálicos adquiridos como materia prima",{"$nulls":10},0]
[237,"Productos de cuero, piel, plástico y hule adquiridos como materia prima",{"$nulls":10},0]
[238,"Mercancías adquiridas para su comercialización",{"$nulls":10},0]
[239,"Otros productos adquiridos como materia prima",{"$nulls":10},0]
[2400,"MATERIALES Y ARTÍCULOS DE CONSTRUCCIÓN Y DE REPARACIÓN",{"$f":"SUM(C65:C73)","v":0},0,0,0,0,0,0,{"$f":"SUM(J65:J73)","v":0},{"$f":"SUM(K65:K73)","v":0},{"$f":"SUM(L65:L73)","v":0},{"$f":"SUM(M65:M73)","v":0}]
[241,"Productos minerales no metálicos",{"$f":"'COG-M'!P218","v":0},null,null,{"$f":"'COG-M'!P219","v":0},{"$f":"'COG-M'!P220","v":0},{"$f":"'COG-M'!P221","v":0},{"$f":"'COG-M'!P222","v":0},{"$f":"'COG-M'!P223","v":0},{"$f":"'COG-M'!P224","v":0},{"$f":"'COG-M'!P225","v":0},{"$f":"SUM(C65:L65)","v":0}]
[242,"Cemento y productos de concreto",{"$f":"'COG-M'!P226","v":0},null,null,{"$f":"'COG-M'!P227","v":0},{"$f":"'COG-M'!P228","v":0},{"$f":"'COG-M'!P229","v":0},{"$f":"'COG-M'!P230","v":0},{"$f":"'COG-M'!P231","v":0},{"$f":"'COG-M'!P232","v":0},{"$f":"'COG-M'!P233","v":0},0]
[243,"Cal, yeso y productos de yeso",{"$f":"'COG-M'!P234","v":0},null,null,{"$f":"'COG-M'!P235","v":0},{"$f":"'COG-M'!P236","v":0},{"$f":"'COG-M'!P237","v":0},{"$f":"'COG-M'!P238","v":0},{"$f":"'COG-M'!P239","v":0},{"$f":"'COG-M'!P240","v":0},{"$f":"'COG-M'!P241","v":0},0]
[244,"Madera y productos de madera",{"$f":"'COG-M'!P242","v":0},null,null,{"$f":"'COG-M'!P243","v":0},{"$f":"'COG-M'!P244","v":0},{"$f":"'COG-M'!P245","v":0},{"$f":"'COG-M'!P246","v":0},{"$f":"'COG-M'!P247","v":0},{"$f":"'COG-M'!P248","v":0},{"$f":"'COG-M'!P249","v":0},0]
[245,"Vidrio y productos de vidrio",{"$f":"'COG-M'!P250","v":0},null,null,{"$f":"'COG-M'!P251","v":0},{"$f":"'COG-M'!P252","v":0},{"$f":"'COG-M'!P253","v":0},{"$f":"'COG-M'!P254","v":0},{"$f":"'COG-M'!P255","v":0},{"$f":"'COG-M'!P256","v":0},{"$f":"'COG-M'!P257","v":0},0]
[246,"Material eléctrico y electrónico",{"$f":"'COG-M'!P258","v":0},null,null,{"$f":"'COG-M'!P259","v":0},{"$f":"'COG-M'!P260","v":0},{"$f":"'COG-M'!P261","v":0},{"$f":"'COG-M'!P262","v":0},{"$f":"'COG-M'!P263","v":0},{"$f":"'COG-M'!P264","v":0},{"$f":"'COG-M'!P265","v":0},0]
[247,"Artículos metálicos para la construcción",{"$f":"'COG-M'!P266","v":0},null,null,{"$f":"'COG-M'!P267","v":0},{"$f":"'COG-M'!P268","v":0},{"$f":"'COG-M'!P269","v":0},{"$f":"'COG-M'!P270","v":0},{"$f":"'COG-M'!P271","v":0},{"$f":"'COG-M'!P272","v":0},{"$f":"'COG-M'!P273","v":0},0]
[248,"Materiales complementarios",{"$f":"'COG-M'!P274","v":0},null,null,{"$f":"'COG-M'!P275","v":0},{"$f":"'COG-M'!P276","v":0},{"$f":"'COG-M'!P277","v":0},{"$f":"'COG-M'!P278","v":0},{"$f":"'COG-M'!P279","v":0},{"$f":"'COG-M'!P280","v":0},{"$f":"'COG-M'!P281","v":0},0]
[249,"Otros materiales y artículos de construcción y reparación",{"$f":"'COG-M'!P282","v":0},null,null,{"$f":"'COG-M'!P283","v":0},{"$f":"'COG-M'!P284","v":0},{"$f":"'COG-M'!P285","v":0},{"$f":"'COG-M'!P286","v":0},{"$f":"'COG-M'!P287","v":0},{"$f":"'COG-M'!P288","v":0},{"$f":"'COG-M'!P289","v":0},0]
[2500,"PRODUCTOS QUÍMICOS, FARMACÉUTICOS Y DE LABORATORIO",{"$f":"SUM(C75:C81)","v":0},0,0,0,0,0,0,{"$f":"SUM(J75:J81)","v":0},{"$f":"SUM(K75:K81)","v":0},{"$f":"SUM(L75:L81)","v":0},{"$f":"SUM(M75:M81)","v":0}]
[251,"Productos químicos básicos",{"$f":"'COG-M'!P291","v":0},null,null,{"$f":"'COG-M'!P292","v":0},{"$f":"'COG-M'!P293","v":0},{"$f":"'COG-M'!P294","v":0},{"$f":"'COG-M'!P295","v":0},{"$nulls":3},{"$f":"SUM(C75:L75)","v":0}]
[252,"Fertilizantes, pesticidas y otros agroquímicos",{"$f":"'COG-M'!P296","v":0},null,null,{"$f":"'COG-M'!P297","v":0},{"$f":"'COG-M'!P298","v":0},{"$f":"'COG-M'!P299","v":0},{"$f":"'COG-M'!P300","v":0},{"$nulls":3},0]
[253,"Medicinas y productos farmacéuticos",{"$f":"'COG-M'!P301","v":0},null,null,{"$f":"'COG-M'!P302","v":0},{"$f":"'COG-M'!P303","v":0},{"$f":"'COG-M'!P304","v":0},{"$f":"'COG-M'!P305","v":0},{"$f":"'COG-M'!P306","v":0},{"$f":"'COG-M'!P307","v":0},{"$f":"'COG-M'!P308","v":0},0]
[254,"Materiales, accesorios y suministros médicos",{"$f":"'COG-M'!P309","v":0},null,null,{"$f":"'COG-M'!P310","v":0},{"$f":"'COG-M'!P311","v":0},{"$f":"'COG-M'!P312","v":0},{"$f":"'COG-M'!P313","v":0},{"$nulls":3},0]
[255,"Materiales, accesorios y suministros de laboratorio",{"$f":"'COG-M'!P314","v":0},null,null,{"$f":"'COG-M'!P315","v":0},{"$f":"'COG-M'!P316","v":0},{"$f":"'COG-M'!P317","v":0},{"$f":"'COG-M'!P318","v":0},{"$f":"'COG-M'!P319","v":0},{"$f":"'COG-M'!P320","v":0},{"$f":"'COG-M'!P321","v":0},0]
[256,"Fibras sintéticas, hules plásticos y derivados",{"$f":"'COG-M'!P322","v":0},null,null,{"$f":"'COG-M'!P323","v":0},{"$f":"'COG-M'!P324","v":0},{"$f":"'COG-M'!P325","v":0},{"$f":"'COG-M'!P326","v":0},{"$nulls":3},0]
[259,"Otros productos químicos",{"$f":"'COG-M'!P327","v":0},null,null,{"$f":"'COG-M'!P328","v":0},{"$f":"'COG-M'!P329","v":0},{"$f":"'COG-M'!P330","v":0},{"$f":"'COG-M'!P331","v":0},{"$nulls":3},0]
[2600,"COMBUSTIBLES, LUBRICANTES Y ADITIVOS",{"$f":"SUM(C83:C84)","v":{"v":159672,"d":"159,672"}},0,0,0,0,0,0,{"$f":"SUM(J83:J84)","v":0},{"$f":"SUM(K83:K84)","v":0},{"$f":"SUM(L83:L84)","v":0},{"$f":"SUM(M83:M84)","v":{"v":159672,"d":"159,672"}}]
[261,"Combustibles, lubricantes y aditivos",{"$f":"'COG-M'!P333","v":{"v":159672,"d":"159,672"}},null,null,{"$f":"'COG-M'!P334","v":0},{"$f":"'COG-M'!P335","v":0},{"$f":"'COG-M'!P336","v":0},{"$f":"'COG-M'!P337","v":0},{"$f":"'COG-M'!P338","v":0},null,null,{"$f":"SUM(C83:L83)","v":{"v":159672,"d":"159,672"}}]
[262,"Carbón y sus derivados",{"$f":"'COG-M'!P339","v":0},null,null,{"$f":"'COG-M'!P340","v":0},{"$f":"'COG-M'!P341","v":0},{"$f":"'COG-M'!P342","v":0},{"$f":"'COG-M'!P343","v":0},{"$nulls":3},{"$f":"SUM(C84:L84)","v":0}]
[2700,"VESTUARIO, BLANCOS, PRENDAS DE PROTECCIÓN Y ARTÍCULOS DEPORTIVOS",{"$f":"SUM(C86:C90)","v":{"v":14268,"d":"14,268"}},0,0,0,0,0,0,{"$f":"SUM(J86:J90)","v":0},{"$f":"SUM(K86:K90)","v":0},{"$f":"SUM(L86:L90)","v":0},{"$f":"SUM(M86:M90)","v":{"v":14268,"d":"14,268"}}]
[271,"Vestuario y uniformes",{"$f":"'COG-M'!P345","v":{"v":14268,"d":"14,268"}},null,null,{"$f":"'COG-M'!P346","v":0},{"$f":"'COG-M'!P347","v":0},{"$f":"'COG-M'!P348","v":0},{"$f":"'COG-M'!P349","v":0},{"$nulls":3},{"$f":"SUM(C86:L86)","v":{"v":14268,"d":"14,268"}}]
[272,"Prendas de seguridad y protección personal",{"$f":"'COG-M'!P350","v":0},null,null,{"$f":"'COG-M'!P351","v":0},{"$f":"'COG-M'!P352","v":0},{"$f":"'COG-M'!P353","v":0},{"$f":"'COG-M'!P354","v":0},{"$f":"'COG-M'!P355","v":0},{"$f":"'COG-M'!P356","v":0},{"$f":"'COG-M'!P357","v":0},{"$f":"SUM(C87:L87)","v":0}]
[273,"Artículos deportivos",{"$f":"'COG-M'!P358","v":0},null,null,{"$f":"'COG-M'!P359","v":0},{"$f":"'COG-M'!P360","v":0},{"$f":"'COG-M'!P361","v":0},{"$f":"'COG-M'!P362","v":0},{"$nulls":3},{"$f":"SUM(C88:L88)","v":0}]
[274,"Productos textiles",{"$f":"'COG-M'!P363","v":0},null,null,{"$f":"'COG-M'!P364","v":0},{"$f":"'COG-M'!P365","v":0},{"$f":"'COG-M'!P366","v":0},{"$f":"'COG-M'!P367","v":0},{"$nulls":3},{"$f":"SUM(C89:L89)","v":0}]
[275,"Blancos y otros productos textiles, excepto prendas de vestir",{"$f":"'COG-M'!P368","v":0},null,null,{"$f":"'COG-M'!P369","v":0},{"$f":"'COG-M'!P370","v":0},{"$f":"'COG-M'!P371","v":0},{"$f":"'COG-M'!P372","v":0},{"$nulls":3},{"$f":"SUM(C90:L90)","v":0}]
[2800,"MATERIALES Y SUMINISTROS PARA SEGURIDAD",{"$f":"SUM(C92:C94)","v":0},0,0,0,0,0,0,{"$f":"SUM(J92:J94)","v":0},{"$f":"SUM(K92:K94)","v":0},{"$f":"SUM(L92:L94)","v":0},{"$f":"SUM(M92:M94)","v":0}]
[281,"Sustancias y materiales explosivos",{"$f":"'COG-M'!P374","v":0},null,null,{"$f":"'COG-M'!P375","v":0},{"$f":"'COG-M'!P376","v":0},{"$f":"'COG-M'!P377","v":0},{"$f":"'COG-M'!P378","v":0},{"$nulls":3},{"$f":"SUM(C92:L92)","v":0}]
[282,"Materiales de seguridad pública",{"$f":"'COG-M'!P379","v":0},null,null,{"$f":"'COG-M'!P380","v":0},{"$f":"'COG-M'!P381","v":0},{"$f":"'COG-M'!P382","v":0},{"$f":"'COG-M'!P383","v":0},{"$f":"'COG-M'!P384","v":0},{"$f":"'COG-M'!P385","v":0},{"$f":"'COG-M'!P386","v":0},{"$f":"SUM(C93:L93)","v":0}]
[283,"Prendas de protección para seguridad pública y nacional",{"$f":"'COG-M'!P387","v":0},null,null,{"$f":"'COG-M'!P388","v":0},{"$f":"'COG-M'!P389","v":0},{"$f":"'COG-M'!P390","v":0},{"$f":"'COG-M'!P391","v":0},{"$f":"'COG-M'!P392","v":0},{"$f":"'COG-M'!P393","v":0},{"$f":"'COG-M'!P394","v":0},{"$f":"SUM(C94:L94)","v":0}]
[2900,"HERRAMIENTAS, REFACCIONES Y ACCESORIOS MENORES",{"$f":"SUM(C96:C104)","v":{"v":13956,"d":"13,956"}},0,0,0,0,0,0,{"$f":"SUM(J96:J104)","v":0},{"$f":"SUM(K96:K104)","v":0},{"$f":"SUM(L96:L104)","v":0},{"$f":"SUM(M96:M104)","v":{"v":13956,"d":"13,956"}}]
[291,"Herramientas menores",{"$f":"'COG-M'!P396","v":0},null,null,{"$f":"'COG-M'!P397","v":0},{"$f":"'COG-M'!P398","v":0},{"$f":"'COG-M'!P399","v":0},{"$f":"'COG-M'!P400","v":0},{"$nulls":3},{"$f":"SUM(C96:L96)","v":0}]
[292,"Refacciones y accesorios menores de edificios",{"$f":"'COG-M'!P401","v":0},null,null,{"$f":"'COG-M'!P402","v":0},{"$f":"'COG-M'!P403","v":0},{"$f":"'COG-M'!P404","v":0},{"$f":"'COG-M'!P405","v":0},{"$nulls":3},0]
[293,"Refacciones y accesorios menores de mobiliario  y equipo de administración, educacional y recreativo",{"$f":"'COG-M'!P406","v":0},null,null,{"$f":"'COG-M'!P407","v":0},{"$f":"'COG-M'!P408","v":0},{"$f":"'COG-M'!P409","v":0},{"$f":"'COG-M'!P410","v":0},{"$nulls":3},0]
[294,"Refacciones y accesorios menores de equipo de cómputo y tecnologías de la información",{"$f":"'COG-M'!P411","v":0},null,null,{"$f":"'COG-M'!P412","v":0},{"$f":"'COG-M'!P413","v":0},{"$f":"'COG-M'!P414","v":0},{"$f":"'COG-M'!P415","v":0},{"$nulls":3},0]
[295,"Refacciones y accesorios menores de equipo e instrumental médico y de laboratorio",{"$f":"'COG-M'!P416","v":0},null,null,{"$f":"'COG-M'!P417","v":0},{"$f":"'COG-M'!P418","v":0},{"$f":"'COG-M'!P419","v":0},{"$f":"'COG-M'!P420","v":0},{"$nulls":3},0]
[296,"Refacciones y accesorios menores de equipo de transporte",{"$f":"'COG-M'!P421","v":{"v":13956,"d":"13,956"}},null,null,{"$f":"'COG-M'!P422","v":0},{"$f":"'COG-M'!P423","v":0},{"$f":"'COG-M'!P424","v":0},{"$f":"'COG-M'!P425","v":0},{"$f":"'COG-M'!P426","v":0},null,null,{"v":13956,"d":"13,956"}]
[297,"Refacciones y accesorios menores de equipo de defensa y seguridad",{"$f":"'COG-M'!P427","v":0},null,null,{"$f":"'COG-M'!P428","v":0},{"$f":"'COG-M'!P429","v":0},{"$f":"'COG-M'!P430","v":0},{"$f":"'COG-M'!P431","v":0},{"$f":"'COG-M'!P432","v":0},null,null,0]
[298,"Refacciones y accesorios menores de maquinaria y otros equipos",{"$f":"'COG-M'!P433","v":0},null,null,{"$f":"'COG-M'!P434","v":0},{"$f":"'COG-M'!P435","v":0},{"$f":"'COG-M'!P436","v":0},{"$f":"'COG-M'!P437","v":0},{"$nulls":3},0]
[299,"Refacciones y accesorios menores otros bienes muebles",{"$f":"'COG-M'!P438","v":0},null,null,{"$f":"'COG-M'!P439","v":0},{"$f":"'COG-M'!P440","v":0},{"$f":"'COG-M'!P441","v":0},{"$f":"'COG-M'!P442","v":0},{"$nulls":3},0]
[3000,"SERVICIOS GENERALES",{"$f":"C106+C116+C126+C136+C146+C156+C164+C174+C180","v":{"v":255372,"d":"255,372"}},{"$f":"D106+D116+D126+D136+D146+D156+D164+D174+D180","v":0},0,0,0,0,0,0,0,0,{"v":255372,"d":"255,372"}]
[3100,"SERVICIOS BÁSICOS",{"$f":"SUM(C107:C115)","v":{"v":93816,"d":"93,816"}},{"$f":"SUM(D107:D115)","v":0},0,0,0,0,0,0,0,0,{"v":93816,"d":"93,816"}]
[311,"Energía eléctrica",{"$f":"'COG-M'!P445","v":{"v":33996,"d":"33,996"}},null,null,{"$f":"'COG-M'!P446","v":0},{"$f":"'COG-M'!P447","v":0},{"$f":"'COG-M'!P448","v":0},{"$f":"'COG-M'!P449","v":0},{"$f":"'COG-M'!P450","v":0},null,null,{"$f":"SUM(C107:L107)","v":{"v":33996,"d":"33,996"}}]
[312,"Gas ",{"$f":"'COG-M'!P451","v":{"v":6804,"d":"6,804"}},null,null,{"$f":"'COG-M'!P452","v":0},{"$f":"'COG-M'!P453","v":0},{"$f":"'COG-M'!P454","v":0},{"$f":"'COG-M'!P455","v":0},{"$nulls":3},{"v":6804,"d":"6,804"}]
[313,"Agua",{"$f":"'COG-M'!P456","v":{"v":13596,"d":"13,596"}},null,null,{"$f":"'COG-M'!P457","v":0},{"$f":"'COG-M'!P458","v":0},{"$f":"'COG-M'!P459","v":0},{"$f":"'COG-M'!P460","v":0},{"$nulls":3},{"v":13596,"d":"13,596"}]
[314,"Telefonía tradicional",{"$f":"'COG-M'!P461","v":{"v":39420,"d":"39,420"}},null,null,{"$f":"'COG-M'!P462","v":0},{"$f":"'COG-M'!P463","v":0},{"$f":"'COG-M'!P464","v":0},{"$f":"'COG-M'!P465","v":0},{"$nulls":3},{"v":39420,"d":"39,420"}]
[315,"Telefonía celular",{"$f":"'COG-M'!P466","v":0},null,null,{"$f":"'COG-M'!P467","v":0},{"$f":"'COG-M'!P468","v":0},{"$f":"'COG-M'!P469","v":0},{"$f":"'COG-M'!P470","v":0},{"$nulls":3},0]
[316,"Servicios de telecomunicaciones y satélites",{"$f":"'COG-M'!P471","v":0},null,null,{"$f":"'COG-M'!P472","v":0},{"$f":"'COG-M'!P473","v":0},{"$f":"'COG-M'!P474","v":0},{"$f":"'COG-M'!P475","v":0},{"$nulls":3},0]
[317,"Servicios de acceso de Internet, redes y procesamiento de información",{"$f":"'COG-M'!P476","v":0},null,null,{"$f":"'COG-M'!P477","v":0},{"$f":"'COG-M'!P478","v":0},{"$f":"'COG-M'!P479","v":0},{"$f":"'COG-M'!P480","v":0},{"$nulls":3},0]
[318,"Servicios postales y telegráficos",{"$f":"'COG-M'!P481","v":0},null,null,{"$f":"'COG-M'!P482","v":0},{"$f":"'COG-M'!P483","v":0},{"$f":"'COG-M'!P484","v":0},{"$f":"'COG-M'!P485","v":0},{"$nulls":3},0]
[319,"Servicios integrales y otros servicios",{"$f":"'COG-M'!P486","v":0},null,null,{"$f":"'COG-M'!P487","v":0},{"$f":"'COG-M'!P488","v":0},{"$f":"'COG-M'!P489","v":0},{"$f":"'COG-M'!P490","v":0},{"$nulls":3},0]
[3200,"SERVICIOS DE ARRENDAMIENTO",{"$f":"SUM(C117:C125)","v":0},{"$f":"SUM(D117:D125)","v":0},0,0,0,0,0,0,0,0,0]
[321,"Arrendamiento de terrenos",{"$f":"'COG-M'!P492","v":0},null,null,{"$f":"'COG-M'!P493","v":0},{"$f":"'COG-M'!P494","v":0},{"$f":"'COG-M'!P495","v":0},{"$f":"'COG-M'!P496","v":0},{"$nulls":3},{"$f":"SUM(C117:L117)","v":0}]
[322,"Arrendamiento de edificios",{"$f":"'COG-M'!P497","v":0},null,null,{"$f":"'COG-M'!P498","v":0},{"$f":"'COG-M'!P499","v":0},{"$f":"'COG-M'!P500","v":0},{"$f":"'COG-M'!P501","v":0},{"$f":"'COG-M'!P502","v":0},null,null,0]
[323,"Arrendamiento de mobiliario y equipo de administración, educacional y recreativo",{"$f":"'COG-M'!P503","v":0},null,null,{"$f":"'COG-M'!P504","v":0},{"$f":"'COG-M'!P505","v":0},{"$f":"'COG-M'!P506","v":0},{"$f":"'COG-M'!P507","v":0},{"$nulls":3},0]
[324,"Arrendamiento de equipo e instrumental médico y de laboratorio",{"$f":"'COG-M'!P508","v":0},null,null,{"$f":"'COG-M'!P509","v":0},{"$f":"'COG-M'!P510","v":0},{"$f":"'COG-M'!P511","v":0},{"$f":"'COG-M'!P512","v":0},{"$nulls":3},0]
[325,"Arrendamiento de equipo de transporte",{"$f":"'COG-M'!P513","v":0},null,null,{"$f":"'COG-M'!P514","v":0},{"$f":"'COG-M'!P515","v":0},{"$f":"'COG-M'!P516","v":0},{"$f":"'COG-M'!P517","v":0},{"$nulls":3},0]
[326,"Arrendamiento de maquinaria, otros equipos y herramientas",{"$f":"'COG-M'!P518","v":0},null,null,{"$f":"'COG-M'!P519","v":0},{"$f":"'COG-M'!P520","v":0},{"$f":"'COG-M'!P521","v":0},{"$f":"'COG-M'!P522","v":0},{"$f":"'COG-M'!P523","v":0},null,null,0]
[327,"Arrendamiento de activos intangibles",{"$f":"'COG-M'!P524","v":0},null,null,{"$f":"'COG-M'!P525","v":0},{"$f":"'COG-M'!P526","v":0},{"$f":"'COG-M'!P527","v":0},{"$f":"'COG-M'!P528","v":0},{"$nulls":3},0]
[328,"Arrendamiento financiero",{"$f":"'COG-M'!P529","v":0},null,null,{"$f":"'COG-M'!P530","v":0},{"$f":"'COG-M'!P531","v":0},{"$f":"'COG-M'!P532","v":0},{"$f":"'COG-M'!P533","v":0},{"$f":"'COG-M'!P534","v":0},null,null,0]
[329,"Otros arrendamientos",{"$f":"'COG-M'!P535","v":0},null,null,{"$f":"'COG-M'!P536","v":0},{"$f":"'COG-M'!P537","v":0},{"$f":"'COG-M'!P538","v":0},{"$f":"'COG-M'!P539","v":0},{"$nulls":3},0]
[3300,"SERVICIOS PROFESIONALES, CIENTÍFICOS, TÉCNICOS Y OTROS SERVICIOS",{"$f":"SUM(C127:C135)","v":{"v":130488,"d":"130,488"}},{"$f":"SUM(D127:D135)","v":0},0,0,0,0,0,0,0,0,{"v":130488,"d":"130,488"}]
[331,"Servicios legales, de contabilidad, auditoría y relacionados",{"$f":"'COG-M'!P541","v":{"v":130488,"d":"130,488"}},null,null,{"$f":"'COG-M'!P542","v":0},{"$f":"'COG-M'!P543","v":0},{"$f":"'COG-M'!P544","v":0},{"$f":"'COG-M'!P545","v":0},{"$nulls":3},{"$f":"SUM(C127:L127)","v":{"v":130488,"d":"130,488"}}]
[332,"Servicios de diseño, arquitectura, ingeniería y actividades relacionadas",{"$f":"'COG-M'!P546","v":0},null,null,{"$f":"'COG-M'!P547","v":0},{"$f":"'COG-M'!P548","v":0},{"$f":"'COG-M'!P549","v":0},{"$f":"'COG-M'!P550","v":0},{"$f":"'COG-M'!P551","v":0},null,null,0]
[333,"Servicios de consultoría administrativa, procesos, técnica y en tecnologías de la información",{"$f":"'COG-M'!P552","v":0},null,null,{"$f":"'COG-M'!P553","v":0},{"$f":"'COG-M'!P554","v":0},{"$f":"'COG-M'!P555","v":0},{"$f":"'COG-M'!P556","v":0},{"$nulls":3},0]
[334,"Servicios de capacitación",{"$f":"'COG-M'!P557","v":0},null,null,{"$f":"'COG-M'!P558","v":0},{"$f":"'COG-M'!P559","v":0},{"$f":"'COG-M'!P560","v":0},{"$f":"'COG-M'!P561","v":0},{"$nulls":3},0]
[335,"Servicios de investigación científica y desarrollo",{"$f":"'COG-M'!P562","v":0},null,null,{"$f":"'COG-M'!P563","v":0},{"$f":"'COG-M'!P564","v":0},{"$f":"'COG-M'!P565","v":0},{"$f":"'COG-M'!P566","v":0},{"$nulls":3},0]
[336,"Servicios de apoyo administrativo, traducción, fotocopiado e impresión",{"$f":"'COG-M'!P567","v":0},null,null,{"$f":"'COG-M'!P568","v":0},{"$f":"'COG-M'!P569","v":0},{"$f":"'COG-M'!P570","v":0},{"$f":"'COG-M'!P571","v":0},{"$nulls":3},0]
[337,"Servicios de protección y seguridad",{"$f":"'COG-M'!P572","v":0},null,null,{"$f":"'COG-M'!P573","v":0},{"$f":"'COG-M'!P574","v":0},{"$f":"'COG-M'!P575","v":0},{"$f":"'COG-M'!P576","v":0},{"$nulls":3},0]
[338,"Servicios de vigilancia",{"$f":"'COG-M'!P577","v":0},null,null,{"$f":"'COG-M'!P578","v":0},{"$f":"'COG-M'!P579","v":0},{"$f":"'COG-M'!P580","v":0},{"$f":"'COG-M'!P581","v":0},{"$nulls":3},0]
[339,"Servicios profesionales, científicos y técnicos integrales",{"$f":"'COG-M'!P582","v":0},null,null,{"$f":"'COG-M'!P583","v":0},{"$f":"'COG-M'!P584","v":0},{"$f":"'COG-M'!P585","v":0},{"$f":"'COG-M'!P586","v":0},{"$nulls":3},0]
[3400,"SERVICIOS FINANCIEROS, BANCARIOS Y COMERCIALES",{"$f":"SUM(C137:C145)","v":0},{"$f":"SUM(D137:D145)","v":0},0,0,0,0,0,0,0,0,0]
[341,"Servicios financieros y bancarios",{"$f":"'COG-M'!P588","v":0},null,null,{"$f":"'COG-M'!P589","v":0},{"$f":"'COG-M'!P590","v":0},{"$f":"'COG-M'!P591","v":0},{"$f":"'COG-M'!P592","v":0},{"$f":"'COG-M'!P593","v":0},{"$f":"'COG-M'!P594","v":0},{"$f":"'COG-M'!P595","v":0},{"$f":"SUM(C137:L137)","v":0}]
[342,"Servicios de cobranza, investigación crediticia y similar",{"$f":"'COG-M'!P596","v":0},null,null,{"$f":"'COG-M'!P597","v":0},{"$f":"'COG-M'!P598","v":0},{"$f":"'COG-M'!P599","v":0},{"$f":"'COG-M'!P600","v":0},{"$nulls":3},0]
[343,"Servicios de recaudación, traslado y custodia de valores",{"$f":"'COG-M'!P601","v":0},null,null,{"$f":"'COG-M'!P602","v":0},{"$f":"'COG-M'!P603","v":0},{"$f":"'COG-M'!P604","v":0},{"$f":"'COG-M'!P605","v":0},{"$f":"'COG-M'!P606","v":0},{"$f":"'COG-M'!P607","v":0},{"$f":"'COG-M'!P608","v":0},0]
[344,"Seguros de responsabilidad patrimonial y fianzas",{"$f":"'COG-M'!P609","v":0},null,null,{"$f":"'COG-M'!P610","v":0},{"$f":"'COG-M'!P611","v":0},{"$f":"'COG-M'!P612","v":0},{"$f":"'COG-M'!P613","v":0},{"$nulls":3},0]
[345,"Seguro de bienes patrimoniales",{"$f":"'COG-M'!P614","v":0},null,null,{"$f":"'COG-M'!P615","v":0},{"$f":"'COG-M'!P616","v":0},{"$f":"'COG-M'!P617","v":0},{"$f":"'COG-M'!P618","v":0},{"$nulls":3},0]
[346,"Almacenaje, envase y embalaje",{"$f":"'COG-M'!P619","v":0},null,null,{"$f":"'COG-M'!P620","v":0},{"$f":"'COG-M'!P621","v":0},{"$f":"'COG-M'!P622","v":0},{"$f":"'COG-M'!P623","v":0},{"$nulls":3},0]
[347,"Fletes y maniobras",{"$f":"'COG-M'!P624","v":0},null,null,{"$f":"'COG-M'!P625","v":0},{"$f":"'COG-M'!P626","v":0},{"$f":"'COG-M'!P627","v":0},{"$f":"'COG-M'!P628","v":0},{"$nulls":3},0]
[348,"Comisiones por ventas",{"$f":"'COG-M'!P629","v":0},null,null,{"$f":"'COG-M'!P630","v":0},{"$f":"'COG-M'!P631","v":0},{"$f":"'COG-M'!P632","v":0},{"$f":"'COG-M'!P633","v":0},{"$nulls":3},0]
[349,"Servicios financieros, bancarios y comerciales integrales",{"$f":"'COG-M'!P634","v":0},null,null,{"$f":"'COG-M'!P635","v":0},{"$f":"'COG-M'!P636","v":0},{"$f":"'COG-M'!P637","v":0},{"$f":"'COG-M'!P638","v":0},{"$nulls":3},0]
[3500,"SERVICIOS DE INSTALACIÓN, REPARACIÓN, MANTENIMIENTO Y CONSERVACIÓN",{"$f":"SUM(C147:C155)","v":0},{"$f":"SUM(D147:D155)","v":0},0,0,0,0,0,0,0,0,0]
[351,"Conservación y mantenimiento menor de inmuebles",{"$f":"'COG-M'!P640","v":0},null,null,{"$f":"'COG-M'!P641","v":0},{"$f":"'COG-M'!P642","v":0},{"$f":"'COG-M'!P643","v":0},{"$f":"'COG-M'!P644","v":0},{"$nulls":3},{"$f":"SUM(C147:L147)","v":0}]
[352,"Instalación, reparación y mantenimiento de mobiliario y equipo de administración, educacional y recreativo",{"$f":"'COG-M'!P645","v":0},null,null,{"$f":"'COG-M'!P646","v":0},{"$f":"'COG-M'!P647","v":0},{"$f":"'COG-M'!P648","v":0},{"$f":"'COG-M'!P649","v":0},{"$nulls":3},0]
[353,"Instalación, reparación y mantenimiento de equipo de cómputo y tecnología de la información",{"$f":"'COG-M'!P650","v":0},null,null,{"$f":"'COG-M'!P651","v":0},{"$f":"'COG-M'!P652","v":0},{"$f":"'COG-M'!P653","v":0},{"$f":"'COG-M'!P654","v":0},{"$nulls":3},0]
[354,"Instalación, reparación y mantenimiento de equipo e instrumental médico y de laboratorio",{"$f":"'COG-M'!P655","v":0},null,null,{"$f":"'COG-M'!P656","v":0},{"$f":"'COG-M'!P657","v":0},{"$f":"'COG-M'!P658","v":0},{"$f":"'COG-M'!P659","v":0},{"$nulls":3},0]
[355,"Reparación y mantenimiento de equipo de transporte",{"$f":"'COG-M'!P660","v":0},null,null,{"$f":"'COG-M'!P661","v":0},{"$f":"'COG-M'!P662","v":0},{"$f":"'COG-M'!P663","v":0},{"$f":"'COG-M'!P664","v":0},{"$f":"'COG-M'!P665","v":0},null,null,0]
[356,"Reparación y mantenimiento de equipo de defensa y seguridad",{"$f":"'COG-M'!P666","v":0},null,null,{"$f":"'COG-M'!P667","v":0},{"$f":"'COG-M'!P668","v":0},{"$f":"'COG-M'!P669","v":0},{"$f":"'COG-M'!P670","v":0},{"$f":"'COG-M'!P671","v":0},null,null,0]
[357,"Instalación, reparación y mantenimiento de maquinaria, otros equipos y herramienta",{"$f":"'COG-M'!P672","v":0},null,null,{"$f":"'COG-M'!P673","v":0},{"$f":"'COG-M'!P674","v":0},{"$f":"'COG-M'!P675","v":0},{"$f":"'COG-M'!P676","v":0},{"$nulls":3},0]
[358,"Servicios de limpieza y manejo de desechos",{"$f":"'COG-M'!P677","v":0},null,null,{"$f":"'COG-M'!P678","v":0},{"$f":"'COG-M'!P679","v":0},{"$f":"'COG-M'!P680","v":0},{"$f":"'COG-M'!P681","v":0},{"$nulls":3},0]
[359,"Servicios de jardinería y fumigación",{"$f":"'COG-M'!P682","v":0},null,null,{"$f":"'COG-M'!P683","v":0},{"$f":"'COG-M'!P684","v":0},{"$f":"'COG-M'!P685","v":0},{"$f":"'COG-M'!P686","v":0},{"$nulls":3},0]
[3600,"SERVICIOS DE COMUNICACIÓN SOCIAL Y PUBLICIDAD",{"$f":"SUM(C157:C163)","v":0},{"$f":"SUM(D157:D163)","v":0},0,0,0,0,0,0,0,0,0]
[361,"Difusión por radio, televisión y otros medios de mensajes sobre programas y actividades gubernamentales",{"$f":"'COG-M'!P688","v":0},null,null,{"$f":"'COG-M'!P689","v":0},{"$f":"'COG-M'!P690","v":0},{"$f":"'COG-M'!P691","v":0},{"$f":"'COG-M'!P692","v":0},{"$nulls":3},{"$f":"SUM(C157:L157)","v":0}]
[362,"Difusión por radio,  televisión y otros medios de mensajes comerciales para promover la venta de bienes o servicios",{"$f":"'COG-M'!P693","v":0},null,null,{"$f":"'COG-M'!P694","v":0},{"$f":"'COG-M'!P695","v":0},{"$f":"'COG-M'!P696","v":0},{"$f":"'COG-M'!P697","v":0},{"$nulls":3},0]
[363,"Servicios de creatividad, preproducción y producción de publicidad, excepto Internet",{"$f":"'COG-M'!P698","v":0},null,null,{"$f":"'COG-M'!P699","v":0},{"$f":"'COG-M'!P700","v":0},{"$f":"'COG-M'!P701","v":0},{"$f":"'COG-M'!P702","v":0},{"$nulls":3},0]
[364,"Servicios de revelado de  fotografías",{"$f":"'COG-M'!P703","v":0},null,null,{"$f":"'COG-M'!P704","v":0},{"$f":"'COG-M'!P705","v":0},{"$f":"'COG-M'!P706","v":0},{"$f":"'COG-M'!P707","v":0},{"$nulls":3},0]
[365,"Servicios de la industria fílmica, del sonido y del video",{"$f":"'COG-M'!P708","v":0},null,null,{"$f":"'COG-M'!P709","v":0},{"$f":"'COG-M'!P710","v":0},{"$f":"'COG-M'!P711","v":0},{"$f":"'COG-M'!P712","v":0},{"$nulls":3},0]
[366,"Servicio de creación y difusión de contenido exclusivamente a través de Internet",{"$f":"'COG-M'!P713","v":0},null,null,{"$f":"'COG-M'!P714","v":0},{"$f":"'COG-M'!P715","v":0},{"$f":"'COG-M'!P716","v":0},{"$f":"'COG-M'!P717","v":0},{"$nulls":3},0]
[369,"Otros servicios de información",{"$f":"'COG-M'!P718","v":0},null,null,{"$f":"'COG-M'!P719","v":0},{"$f":"'COG-M'!P720","v":0},{"$f":"'COG-M'!P721","v":0},{"$f":"'COG-M'!P722","v":0},{"$nulls":3},0]
[3700,"SERVICIOS DE TRASLADO Y VIÁTICOS",{"$f":"SUM(C165:C173)","v":{"v":31068,"d":"31,068"}},{"$f":"SUM(D165:D173)","v":0},0,0,0,0,0,0,0,0,{"$f":"SUM(M165:M173)","v":{"v":31068,"d":"31,068"}}]
[371,"Pasajes aéreos",{"$f":"'COG-M'!P724","v":0},null,null,{"$f":"'COG-M'!P725","v":0},{"$f":"'COG-M'!P726","v":0},{"$f":"'COG-M'!P727","v":0},{"$f":"'COG-M'!P728","v":0},{"$nulls":3},{"$f":"SUM(C165:L165)","v":0}]
[372,"Pasajes terrestres",{"$f":"'COG-M'!P729","v":{"v":31068,"d":"31,068"}},null,null,{"$f":"'COG-M'!P730","v":0},{"$f":"'COG-M'!P731","v":0},{"$f":"'COG-M'!P732","v":0},{"$f":"'COG-M'!P733","v":0},{"$nulls":3},{"v":31068,"d":"31,068"}]
[373,"Pasajes marítimos, lacustres y fluviales",{"$f":"'COG-M'!P734","v":0},null,null,{"$f":"'COG-M'!P735","v":0},{"$f":"'COG-M'!P736","v":0},{"$f":"'COG-M'!P737","v":0},{"$f":"'COG-M'!P738","v":0},{"$nulls":3},0]
[374,"Autotransporte",{"$f":"'COG-M'!P739","v":0},null,null,{"$f":"'COG-M'!P740","v":0},{"$f":"'COG-M'!P741","v":0},{"$f":"'COG-M'!P742","v":0},{"$f":"'COG-M'!P743","v":0},{"$nulls":3},0]
[375,"Viáticos en el país",{"$f":"'COG-M'!P744","v":0},null,null,{"$f":"'COG-M'!P745","v":0},{"$f":"'COG-M'!P746","v":0},{"$f":"'COG-M'!P747","v":0},{"$f":"'COG-M'!P748","v":0},{"$nulls":3},0]
[376,"Viáticos en el extranjero ",{"$f":"'COG-M'!P749","v":0},null,null,{"$f":"'COG-M'!P750","v":0},{"$f":"'COG-M'!P751","v":0},{"$f":"'COG-M'!P752","v":0},{"$f":"'COG-M'!P753","v":0},{"$nulls":3},0]
[377,"Gastos de instalación y traslado de menaje",{"$f":"'COG-M'!P754","v":0},null,null,{"$f":"'COG-M'!P755","v":0},{"$f":"'COG-M'!P756","v":0},{"$f":"'COG-M'!P757","v":0},{"$f":"'COG-M'!P758","v":0},{"$nulls":3},0]
[378,"Servicios integrales de traslado y viáticos",{"$f":"'COG-M'!P759","v":0},null,null,{"$f":"'COG-M'!P760","v":0},{"$f":"'COG-M'!P761","v":0},{"$f":"'COG-M'!P762","v":0},{"$f":"'COG-M'!P763","v":0},{"$nulls":3},0]
[379,"Otros servicios de traslado y hospedaje",{"$f":"'COG-M'!P764","v":0},null,null,{"$f":"'COG-M'!P765","v":0},{"$f":"'COG-M'!P766","v":0},{"$f":"'COG-M'!P767","v":0},{"$f":"'COG-M'!P768","v":0},{"$nulls":3},0]
[3800,"SERVICIOS OFICIALES",{"$f":"SUM(C175:C179)","v":0},{"$f":"SUM(D175:D179)","v":0},0,0,0,0,0,0,0,0,0]
[381,"Gastos de ceremonial",{"$f":"'COG-M'!P770","v":0},null,null,{"$f":"'COG-M'!P771","v":0},{"$f":"'COG-M'!P772","v":0},{"$f":"'COG-M'!P773","v":0},{"$f":"'COG-M'!P774","v":0},{"$nulls":3},{"$f":"SUM(C175:L175)","v":0}]
[382,"Gastos de orden  social y cultural",{"$f":"'COG-M'!P775","v":0},null,null,{"$f":"'COG-M'!P776","v":0},{"$f":"'COG-M'!P777","v":0},{"$f":"'COG-M'!P778","v":0},{"$f":"'COG-M'!P779","v":0},{"$nulls":3},{"$f":"SUM(C176:L176)","v":0}]
[383,"Congresos y convenciones",{"$f":"'COG-M'!P780","v":0},null,null,{"$f":"'COG-M'!P781","v":0},{"$f":"'COG-M'!P782","v":0},{"$f":"'COG-M'!P783","v":0},{"$f":"'COG-M'!P784","v":0},{"$nulls":3},{"$f":"SUM(C177:L177)","v":0}]
[384,"Exposiciones",{"$f":"'COG-M'!P785","v":0},null,null,{"$f":"'COG-M'!P786","v":0},{"$f":"'COG-M'!P787","v":0},{"$f":"'COG-M'!P788","v":0},{"$f":"'COG-M'!P789","v":0},{"$nulls":3},{"$f":"SUM(C178:L178)","v":0}]
[385,"Gastos de representación",{"$f":"'COG-M'!P790","v":0},null,null,{"$f":"'COG-M'!P791","v":0},{"$f":"'COG-M'!P792","v":0},{"$f":"'COG-M'!P793","v":0},{"$f":"'COG-M'!P794","v":0},{"$nulls":3},{"$f":"SUM(C179:L179)","v":0}]
[3900,"OTROS SERVICIOS GENERALES",{"$f":"SUM(C181:C189)","v":0},{"$f":"SUM(D181:D189)","v":0},0,0,0,0,0,0,0,0,0]
[391,"Servicios funerarios y de cementerios",{"$f":"'COG-M'!P796","v":0},null,null,{"$f":"'COG-M'!P797","v":0},{"$f":"'COG-M'!P798","v":0},{"$f":"'COG-M'!P799","v":0},{"$f":"'COG-M'!P800","v":0},{"$nulls":3},{"$f":"SUM(C181:L181)","v":0}]
[392,"Impuestos y derechos",{"$f":"'COG-M'!P801","v":0},null,null,{"$f":"'COG-M'!P802","v":0},{"$f":"'COG-M'!P803","v":0},{"$f":"'COG-M'!P804","v":0},{"$f":"'COG-M'!P805","v":0},{"$nulls":3},0]
[393,"Impuestos y derechos de importación",{"$f":"'COG-M'!P806","v":0},null,null,{"$f":"'COG-M'!P807","v":0},{"$f":"'COG-M'!P808","v":0},{"$f":"'COG-M'!P809","v":0},{"$f":"'COG-M'!P810","v":0},{"$nulls":3},0]
[394,"Sentencias y resoluciones por autoridad competente",{"$f":"'COG-M'!P811","v":0},null,null,{"$f":"'COG-M'!P812","v":0},{"$f":"'COG-M'!P813","v":0},{"$f":"'COG-M'!P814","v":0},{"$f":"'COG-M'!P815","v":0},{"$nulls":3},0]
[395,"Penas, multas, accesorios y actualizaciones",{"$f":"'COG-M'!P816","v":0},null,null,{"$f":"'COG-M'!P817","v":0},{"$f":"'COG-M'!P818","v":0},{"$f":"'COG-M'!P819","v":0},{"$f":"'COG-M'!P820","v":0},{"$nulls":3},0]
[396,"Otros gastos por responsabilidades",{"$f":"'COG-M'!P821","v":0},null,null,{"$f":"'COG-M'!P822","v":0},{"$f":"'COG-M'!P823","v":0},{"$f":"'COG-M'!P824","v":0},{"$f":"'COG-M'!P825","v":0},{"$nulls":3},0]
[397,"Utilidades",{"$nulls":10},0]
[398,"Impuesto sobre nómina y otros que se deriven de una relación laboral",{"$f":"'COG-M'!P827","v":0},null,null,{"$f":"'COG-M'!P828","v":0},{"$f":"'COG-M'!P829","v":0},{"$f":"'COG-M'!P830","v":0},{"$f":"'COG-M'!P831","v":0},{"$nulls":3},0]
[399,"Otros servicios generales",{"$f":"'COG-M'!P832","v":0},null,null,{"$f":"'COG-M'!P833","v":0},{"$f":"'COG-M'!P834","v":0},{"$f":"'COG-M'!P835","v":0},{"$f":"'COG-M'!P836","v":0},{"$nulls":3},0]
[4000,"TRANSFERENCIAS, ASIGNACIONES, SUBSIDIOS Y OTRAS  AYUDAS",{"$f":"C191+C201+C207+C217+C226+C230+C238+C240+C246","v":{"v":69816,"d":"69,816"}},{"$f":"D191+D201+D207+D217+D226+D230+D238+D240+D246","v":0},0,0,0,0,0,0,0,0,{"v":69816,"d":"69,816"}]
[4100,"TRANSFERENCIAS INTERNAS Y ASIGNACIONES AL SECTOR PÚBLICO",{"$f":"SUM(C192:C200)","v":0},{"$f":"SUM(D192:D200)","v":0},0,0,0,0,0,0,0,0,0]
[411,"Asignaciones presupuestarias al Poder Ejecutivo",{"$nulls":10},{"$f":"SUM(C192:L192)","v":0}]
[412,"Asignaciones presupuestarias al Poder Legislativo",{"$nulls":10},0]
[413,"Asignaciones presupuestarias al Poder Judicial",{"$nulls":10},0]
[414,"Asignaciones presupuestarias a Órganos Autónomos",{"$nulls":10},0]
[415,"Transferencias internas otorgadas a entidades paraestatales no empresariales y no financieras",{"$f":"'COG-M'!P843","v":0},null,null,{"$f":"'COG-M'!P844","v":0},{"$f":"'COG-M'!P845","v":0},{"$f":"'COG-M'!P846","v":0},{"$f":"'COG-M'!P847","v":0},{"$nulls":3},0]
[416,"Transferencias internas otorgadas a entidades paraestatales empresariales y no financieras",{"$nulls":10},0]
[417,"Transferencias internas otorgadas a fideicomisos públicos empresariales y no financieros",{"$f":"'COG-M'!P849","v":0},null,null,{"$f":"'COG-M'!P850","v":0},{"$f":"'COG-M'!P851","v":0},{"$f":"'COG-M'!P852","v":0},{"$f":"'COG-M'!P853","v":0},{"$nulls":3},0]
[418,"Transferencias internas otorgadas a instituciones paraestatales públicas financieras",{"$nulls":10},0]
[419,"Transferencias internas otorgadas a fideicomisos públicos financieros",{"$nulls":10},0]
[4200,"TRANSFERENCIAS AL RESTO DEL SECTOR PÚBLICO",{"$f":"SUM(C202:C206)","v":0},{"$f":"SUM(D202:D206)","v":0},0,0,0,0,0,0,0,0,{"$f":"SUM(M202:M206)","v":0}]
[421,"Transferencias otorgadas a entidades paraestatales no empresariales y no financieras",{"$f":"'COG-M'!P857","v":0},null,null,{"$f":"'COG-M'!P858","v":0},{"$f":"'COG-M'!P859","v":0},{"$f":"'COG-M'!P860","v":0},{"$f":"'COG-M'!P861","v":0},{"$nulls":3},{"$f":"SUM(C202:L202)","v":0}]
[422,"Transferencias otorgadas para entidades paraestatales empresariales y no financieras",{"$nulls":10},{"$f":"SUM(C203:L203)","v":0}]
[423,"Transferencias otorgadas para instituciones paraestatales públicas financieras  ",{"$nulls":10},{"$f":"SUM(C204:L204)","v":0}]
[424,"Transferencias otorgadas a entidades federativas y municipios",{"$nulls":10},{"$f":"SUM(C205:L205)","v":0}]
[425,"Transferencias a fideicomisos de entidades federativas y municipios",{"$nulls":10},{"$f":"SUM(C206:L206)","v":0}]
[4300,"SUBSIDIOS Y SUBVENCIONES",{"$f":"SUM(C208:C216)","v":0},{"$f":"SUM(D208:D216)","v":0},0,0,0,0,0,0,0,0,0]
[431,"Subsidios a la producción",{"$f":"'COG-M'!P867","v":0},null,null,{"$f":"'COG-M'!P868","v":0},{"$f":"'COG-M'!P869","v":0},{"$f":"'COG-M'!P870","v":0},{"$f":"'COG-M'!P871","v":0},{"$f":"'COG-M'!P872","v":0},{"$f":"'COG-M'!P873","v":0},{"$f":"'COG-M'!P874","v":0},{"$f":"SUM(C208:L208)","v":0}]
[432,"Subsidios a la distribución",{"$f":"'COG-M'!P875","v":0},null,null,{"$f":"'COG-M'!P876","v":0},{"$f":"'COG-M'!P877","v":0},{"$f":"'COG-M'!P878","v":0},{"$f":"'COG-M'!P879","v":0},{"$f":"'COG-M'!P880","v":0},{"$f":"'COG-M'!P881","v":0},{"$f":"'COG-M'!P882","v":0},0]
[433,"Subsidios a la inversión",{"$f":"'COG-M'!P883","v":0},null,null,{"$f":"'COG-M'!P884","v":0},{"$f":"'COG-M'!P885","v":0},{"$f":"'COG-M'!P886","v":0},{"$f":"'COG-M'!P887","v":0},{"$f":"'COG-M'!P888","v":0},{"$f":"'COG-M'!P889","v":0},{"$f":"'COG-M'!P890","v":0},0]
[434,"Subsidios a la prestación de servicios públicos",{"$f":"'COG-M'!P891","v":0},null,null,{"$f":"'COG-M'!P892","v":0},{"$f":"'COG-M'!P893","v":0},{"$f":"'COG-M'!P894","v":0},{"$f":"'COG-M'!P895","v":0},{"$f":"'COG-M'!P896","v":0},{"$f":"'COG-M'!P897","v":0},{"$f":"'COG-M'!P898","v":0},0]
[435,"Subsidios para cubrir diferenciales de tasas de interés",{"$f":"'COG-M'!P899","v":0},null,null,{"$f":"'COG-M'!P900","v":0},{"$f":"'COG-M'!P901","v":0},{"$f":"'COG-M'!P902","v":0},{"$f":"'COG-M'!P903","v":0},{"$f":"'COG-M'!P904","v":0},{"$f":"'COG-M'!P905","v":0},{"$f":"'COG-M'!P906","v":0},0]
[436,"Subsidios a la vivienda ",{"$f":"'COG-M'!P907","v":0},null,null,{"$f":"'COG-M'!P908","v":0},{"$f":"'COG-M'!P909","v":0},{"$f":"'COG-M'!P910","v":0},{"$f":"'COG-M'!P911","v":0},{"$f":"'COG-M'!P912","v":0},{"$f":"'COG-M'!P913","v":0},{"$f":"'COG-M'!P914","v":0},0]
[437,"Subvenciones al consumo",{"$f":"'COG-M'!P915","v":0},null,null,{"$f":"'COG-M'!P916","v":0},{"$f":"'COG-M'!P917","v":0},{"$f":"'COG-M'!P918","v":0},{"$f":"'COG-M'!P919","v":0},{"$f":"'COG-M'!P920","v":0},{"$f":"'COG-M'!P921","v":0},{"$f":"'COG-M'!P922","v":0},0]
[438,"Subsidios a entidades federativas y municipios",{"$nulls":10},0]
[439,"Otros subsidios",{"$f":"'COG-M'!P924","v":0},null,null,{"$f":"'COG-M'!P925","v":0},{"$f":"'COG-M'!P926","v":0},{"$f":"'COG-M'!P927","v":0},{"$f":"'COG-M'!P928","v":0},{"$f":"'COG-M'!P929","v":0},{"$f":"'COG-M'!P930","v":0},{"$f":"'COG-M'!P931","v":0},0]
[4400,"AYUDAS SOCIALES",{"$f":"SUM(C218:C225)","v":{"v":69816,"d":"69,816"}},{"$f":"SUM(D218:D225)","v":0},0,0,0,0,0,0,0,0,{"v":69816,"d":"69,816"}]
[441,"Ayudas sociales a personas ",{"$f":"'COG-M'!P933","v":{"v":69816,"d":"69,816"}},null,null,{"$f":"'COG-M'!P934","v":0},{"$f":"'COG-M'!P935","v":0},{"$f":"'COG-M'!P936","v":0},{"$f":"'COG-M'!P937","v":0},{"$f":"'COG-M'!P938","v":0},{"$f":"'COG-M'!P939","v":0},{"$f":"'COG-M'!P940","v":0},{"$f":"SUM(C218:L218)","v":{"v":69816,"d":"69,816"}}]
[442,"Becas y otras ayudas para programas de capacitación",{"$f":"'COG-M'!P941","v":0},null,null,{"$f":"'COG-M'!P942","v":0},{"$f":"'COG-M'!P943","v":0},{"$f":"'COG-M'!P944","v":0},{"$f":"'COG-M'!P945","v":0},{"$f":"'COG-M'!P946","v":0},{"$f":"'COG-M'!P947","v":0},{"$f":"'COG-M'!P948","v":0},0]
[443,"Ayudas sociales a instituciones de enseñanza",{"$f":"'COG-M'!P949","v":0},null,null,{"$f":"'COG-M'!P950","v":0},{"$f":"'COG-M'!P951","v":0},{"$f":"'COG-M'!P952","v":0},{"$f":"'COG-M'!P953","v":0},{"$f":"'COG-M'!P954","v":0},{"$f":"'COG-M'!P955","v":0},{"$f":"'COG-M'!P956","v":0},0]
[444,"Ayudas sociales a actividades científicas o académicas",{"$f":"'COG-M'!P957","v":0},null,null,{"$f":"'COG-M'!P958","v":0},{"$f":"'COG-M'!P959","v":0},{"$f":"'COG-M'!P960","v":0},{"$f":"'COG-M'!P961","v":0},{"$f":"'COG-M'!P962","v":0},{"$f":"'COG-M'!P963","v":0},{"$f":"'COG-M'!P964","v":0},0]
[445,"Ayudas sociales a instituciones sin fines de lucro",{"$f":"'COG-M'!P965","v":0},null,null,{"$f":"'COG-M'!P966","v":0},{"$f":"'COG-M'!P967","v":0},{"$f":"'COG-M'!P968","v":0},{"$f":"'COG-M'!P969","v":0},{"$f":"'COG-M'!P970","v":0},{"$f":"'COG-M'!P971","v":0},{"$f":"'COG-M'!P972","v":0},0]
[446,"Ayudas sociales a cooperativas",{"$f":"'COG-M'!P973","v":0},null,null,{"$f":"'COG-M'!P974","v":0},{"$f":"'COG-M'!P975","v":0},{"$f":"'COG-M'!P976","v":0},{"$f":"'COG-M'!P977","v":0},{"$f":"'COG-M'!P978","v":0},{"$f":"'COG-M'!P979","v":0},{"$f":"'COG-M'!P980","v":0},0]
[447,"Ayudas sociales a entidades de interés público",{"$f":"'COG-M'!P981","v":0},null,null,{"$f":"'COG-M'!P982","v":0},{"$f":"'COG-M'!P983","v":0},{"$f":"'COG-M'!P984","v":0},{"$f":"'COG-M'!P985","v":0},{"$f":"'COG-M'!P986","v":0},{"$f":"'COG-M'!P987","v":0},{"$f":"'COG-M'!P988","v":0},0]
[448,"Ayudas por desastres naturales y otros siniestros",{"$f":"'COG-M'!P989","v":0},null,null,{"$f":"'COG-M'!P990","v":0},{"$f":"'COG-M'!P991","v":0},{"$f":"'COG-M'!P992","v":0},{"$f":"'COG-M'!P993","v":0},{"$f":"'COG-M'!P994","v":0},{"$f":"'COG-M'!P995","v":0},{"$f":"'COG-M'!P996","v":0},0]
[4500,"PENSIONES Y JUBILACIONES",{"$f":"SUM(C227:C229)","v":0},{"$f":"SUM(D227:D229)","v":0},0,0,0,0,0,0,0,0,0]
[451,"Pensiones",{"$f":"'COG-M'!P998","v":0},null,null,{"$f":"'COG-M'!P999","v":0},{"$f":"'COG-M'!P1000","v":0},{"$f":"'COG-M'!P1001","v":0},{"$f":"'COG-M'!P1002","v":0},{"$nulls":3},{"$f":"SUM(C227:L227)","v":0}]
[452,"Jubilaciones",{"$f":"'COG-M'!P1003","v":0},null,null,{"$f":"'COG-M'!P1004","v":0},{"$f":"'COG-M'!P1005","v":0},{"$f":"'COG-M'!P1006","v":0},{"$f":"'COG-M'!P1007","v":0},{"$nulls":3},{"$f":"SUM(C228:L228)","v":0}]
[459,"Otras pensiones y jubilaciones",{"$f":"'COG-M'!P1008","v":0},null,null,{"$f":"'COG-M'!P1009","v":0},{"$f":"'COG-M'!P1010","v":0},{"$f":"'COG-M'!P1011","v":0},{"$f":"'COG-M'!P1012","v":0},{"$nulls":3},{"$f":"SUM(C229:L229)","v":0}]
[4600,"TRANSFERENCIAS A FIDEICOMISOS, MANDATOS Y OTROS ANÁLOGOS",{"$f":"SUM(C231:C237)","v":0},{"$f":"SUM(D231:D237)","v":0},0,0,0,0,0,0,0,0,0]
[461,"Transferencias a fideicomisos del Poder Ejecutivo",{"$f":"'COG-M'!P1014","v":0},null,null,{"$f":"'COG-M'!P1015","v":0},{"$f":"'COG-M'!P1016","v":0},{"$f":"'COG-M'!P1017","v":0},{"$f":"'COG-M'!P1018","v":0},{"$nulls":3},{"$f":"SUM(C231:L231)","v":0}]
[462,"Transferencias a fideicomisos del Poder Legislativo",{"$nulls":10},0]
[463,"Transferencias a fideicomisos del Poder Judicial",{"$nulls":10},0]
[464,"Trasferencias a fideicomisos públicos de entidades paraestatales no empresariales y no financieras",{"$f":"'COG-M'!P1021","v":0},null,null,{"$f":"'COG-M'!P1022","v":0},{"$f":"'COG-M'!P1023","v":0},{"$f":"'COG-M'!P1024","v":0},{"$f":"'COG-M'!P1025","v":0},{"$nulls":3},0]
[465,"Transferencias a fideicomisos públicos de entidades paraestatales empresariales y no financieras",{"$nulls":10},0]
[466,"Transferencias a fideicomisos de instituciones públicas financieras",{"$nulls":10},0]
[469,"Otras transferencias a fideicomisos   ",{"$f":"'COG-M'!P1028","v":0},null,null,{"$f":"'COG-M'!P1029","v":0},{"$f":"'COG-M'!P1030","v":0},{"$f":"'COG-M'!P1031","v":0},{"$f":"'COG-M'!P1032","v":0},{"$nulls":3},0]
[4700,"TRANSFERENCIAS A LA SEGURIDAD SOCIAL",{"$f":"SUM(C239)","v":0},{"$f":"SUM(D239)","v":0},0,0,0,0,0,0,0,0,0]
[471,"Transferencias por obligación de ley",{"$f":"'COG-M'!P1034","v":0},null,null,{"$f":"'COG-M'!P1035","v":0},{"$f":"'COG-M'!P1036","v":0},{"$f":"'COG-M'!P1037","v":0},{"$f":"'COG-M'!P1038","v":0},{"$nulls":3},{"$f":"SUM(C239:L239)","v":0}]
[4800,"DONATIVOS",{"$f":"SUM(C241:C245)","v":0},{"$f":"SUM(D241:D245)","v":0},0,0,0,0,0,0,0,0,0]
[481,"Donativos a instituciones sin fines de lucro",{"$f":"'COG-M'!P1040","v":0},null,null,{"$f":"'COG-M'!P1041","v":0},{"$f":"'COG-M'!P1042","v":0},{"$f":"'COG-M'!P1043","v":0},{"$f":"'COG-M'!P1044","v":0},{"$nulls":3},{"$f":"SUM(C241:L241)","v":0}]
[482,"Donativos a entidades federativas ",{"$f":"'COG-M'!P1045","v":0},null,null,{"$f":"'COG-M'!P1046","v":0},{"$f":"'COG-M'!P1047","v":0},{"$f":"'COG-M'!P1048","v":0},{"$f":"'COG-M'!P1049","v":0},{"$nulls":3},{"$f":"SUM(C242:L242)","v":0}]
[483,"Donativos a fideicomisos privados",{"$f":"'COG-M'!P1050","v":0},null,null,{"$f":"'COG-M'!P1051","v":0},{"$f":"'COG-M'!P1052","v":0},{"$f":"'COG-M'!P1053","v":0},{"$f":"'COG-M'!P1054","v":0},{"$nulls":3},{"$f":"SUM(C243:L243)","v":0}]
[484,"Donativos a fideicomisos estatales",{"$f":"'COG-M'!P1055","v":0},null,null,{"$f":"'COG-M'!P1056","v":0},{"$f":"'COG-M'!P1057","v":0},{"$f":"'COG-M'!P1058","v":0},{"$f":"'COG-M'!P1059","v":0},{"$nulls":3},{"$f":"SUM(C244:L244)","v":0}]
[485,"Donativos internacionales",{"$f":"'COG-M'!P1060","v":0},null,null,{"$f":"'COG-M'!P1061","v":0},{"$f":"'COG-M'!P1062","v":0},{"$f":"'COG-M'!P1063","v":0},{"$f":"'COG-M'!P1064","v":0},{"$nulls":3},{"$f":"SUM(C245:L245)","v":0}]
[4900,"TRANSFERENCIAS AL EXTERIOR",{"$f":"SUM(C247:C249)","v":0},{"$f":"SUM(D247:D249)","v":0},0,0,0,0,0,0,0,0,0]
[491,"Transferencias para gobiernos extranjeros",{"$f":"'COG-M'!P1066","v":0},null,null,{"$f":"'COG-M'!P1067","v":0},{"$f":"'COG-M'!P1068","v":0},{"$f":"'COG-M'!P1069","v":0},{"$f":"'COG-M'!P1070","v":0},{"$nulls":3},{"$f":"SUM(C247:L247)","v":0}]
[492,"Transferencias para organismos internacionales",{"$f":"'COG-M'!P1071","v":0},null,null,{"$f":"'COG-M'!P1072","v":0},{"$f":"'COG-M'!P1073","v":0},{"$f":"'COG-M'!P1074","v":0},{"$f":"'COG-M'!P1075","v":0},{"$nulls":3},{"$f":"SUM(C248:L248)","v":0}]
[493,"Transferencias para el sector privado externo",{"$f":"'COG-M'!P1076","v":0},null,null,{"$f":"'COG-M'!P1077","v":0},{"$f":"'COG-M'!P1078","v":0},{"$f":"'COG-M'!P1079","v":0},{"$f":"'COG-M'!P1080","v":0},{"$nulls":3},{"$f":"SUM(C249:L249)","v":0}]
[5000,"BIENES MUEBLES, INMUEBLES E INTANGIBLES ",{"$f":"C251+C258+C263+C266+C273+C275+C284+C294+C299","v":{"v":19416,"d":"19,416"}},{"$f":"D251+D258+D263+D266+D273+D275+D284+D294+D299","v":0},0,0,0,0,0,0,0,0,{"v":19416,"d":"19,416"}]
[5100,"MOBILIARIO Y EQUIPO DE ADMINISTRACIÓN",{"$f":"SUM(C252:C257)","v":{"v":19416,"d":"19,416"}},{"$f":"SUM(D252:D257)","v":0},0,0,0,0,0,0,0,0,{"v":19416,"d":"19,416"}]
[511,"Muebles de oficina y estantería ",{"$f":"'COG-M'!P1083","v":0},{"$f":"'COG-M'!P1084","v":0},null,{"$f":"'COG-M'!P1085","v":0},{"$f":"'COG-M'!P1086","v":0},{"$f":"'COG-M'!P1087","v":0},{"$f":"'COG-M'!P1088","v":0},{"$f":"'COG-M'!P1089","v":0},{"$f":"'COG-M'!P1090","v":0},{"$f":"'COG-M'!P1091","v":0},{"$f":"SUM(C252:L252)","v":0}]
[512,"Muebles, excepto de oficina y estantería",{"$f":"'COG-M'!P1092","v":0},{"$f":"'COG-M'!P1093","v":0},null,{"$f":"'COG-M'!P1094","v":0},{"$f":"'COG-M'!P1095","v":0},{"$f":"'COG-M'!P1096","v":0},{"$f":"'COG-M'!P1097","v":0},{"$f":"'COG-M'!P1098","v":0},{"$f":"'COG-M'!P1099","v":0},{"$f":"'COG-M'!P1100","v":0},0]
[513,"Bienes artísticos, culturales y científicos",{"$f":"'COG-M'!P1101","v":0},{"$f":"'COG-M'!P1102","v":0},null,{"$f":"'COG-M'!P1103","v":0},{"$f":"'COG-M'!P1104","v":0},{"$f":"'COG-M'!P1105","v":0},{"$f":"'COG-M'!P1106","v":0},{"$f":"'COG-M'!P1107","v":0},{"$f":"'COG-M'!P1108","v":0},{"$f":"'COG-M'!P1109","v":0},0]
[514,"Objetos de valor",{"$f":"'COG-M'!P1110","v":0},{"$f":"'COG-M'!P1111","v":0},null,{"$f":"'COG-M'!P1112","v":0},{"$f":"'COG-M'!P1113","v":0},{"$f":"'COG-M'!P1114","v":0},{"$f":"'COG-M'!P1115","v":0},{"$f":"'COG-M'!P1116","v":0},{"$f":"'COG-M'!P1117","v":0},{"$f":"'COG-M'!P1118","v":0},0]
[515,"Equipo de cómputo de tecnologías de la información",{"$f":"'COG-M'!P1119","v":{"v":19416,"d":"19,416"}},{"$f":"'COG-M'!P1120","v":0},null,{"$f":"'COG-M'!P1121","v":0},{"$f":"'COG-M'!P1122","v":0},{"$f":"'COG-M'!P1123","v":0},{"$f":"'COG-M'!P1124","v":0},{"$f":"'COG-M'!P1125","v":0},{"$f":"'COG-M'!P1126","v":0},{"$f":"'COG-M'!P1127","v":0},{"v":19416,"d":"19,416"}]
[519,"Otros mobiliarios y equipos de administración",{"$f":"'COG-M'!P1128","v":0},{"$f":"'COG-M'!P1129","v":0},null,{"$f":"'COG-M'!P1130","v":0},{"$f":"'COG-M'!P1131","v":0},{"$f":"'COG-M'!P1132","v":0},{"$f":"'COG-M'!P1133","v":0},{"$f":"'COG-M'!P1134","v":0},{"$f":"'COG-M'!P1135","v":0},{"$f":"'COG-M'!P1136","v":0},0]
[5200,"MOBILIARIO Y EQUIPO EDUCACIONAL Y RECREATIVO",{"$f":"SUM(C259:C262)","v":0},{"$f":"SUM(D259:D262)","v":0},0,0,0,0,0,0,0,0,0]
[521,"Equipos y aparatos audiovisuales",{"$f":"'COG-M'!P1138","v":0},{"$f":"'COG-M'!P1139","v":0},null,{"$f":"'COG-M'!P1140","v":0},{"$f":"'COG-M'!P1141","v":0},{"$f":"'COG-M'!P1142","v":0},{"$f":"'COG-M'!P1143","v":0},{"$f":"'COG-M'!P1144","v":0},{"$f":"'COG-M'!P1145","v":0},{"$f":"'COG-M'!P1146","v":0},{"$f":"SUM(C259:L259)","v":0}]
[522,"Aparatos deportivos",{"$f":"'COG-M'!P1147","v":0},{"$f":"'COG-M'!P1148","v":0},null,{"$f":"'COG-M'!P1149","v":0},{"$f":"'COG-M'!P1150","v":0},{"$f":"'COG-M'!P1151","v":0},{"$f":"'COG-M'!P1152","v":0},{"$f":"'COG-M'!P1153","v":0},{"$f":"'COG-M'!P1154","v":0},{"$f":"'COG-M'!P1155","v":0},{"$f":"SUM(C260:L260)","v":0}]
[523,"Cámaras fotográficas y de video",{"$f":"'COG-M'!P1156","v":0},{"$f":"'COG-M'!P1157","v":0},null,null,{"$f":"'COG-M'!P1158","v":0},{"$f":"'COG-M'!P1159","v":0},{"$f":"'COG-M'!P1160","v":0},{"$f":"'COG-M'!P1161","v":0},{"$f":"'COG-M'!P1162","v":0},{"$f":"'COG-M'!P1163","v":0},{"$f":"SUM(C261:L261)","v":0}]
[529,"Otro mobiliario y equipo educacional y recreativo ",{"$f":"'COG-M'!P1164","v":0},{"$f":"'COG-M'!P1165","v":0},null,{"$f":"'COG-M'!P1166","v":0},{"$f":"'COG-M'!P1167","v":0},{"$f":"'COG-M'!P1168","v":0},{"$f":"'COG-M'!P1169","v":0},{"$f":"'COG-M'!P1170","v":0},{"$f":"'COG-M'!P1171","v":0},{"$f":"'COG-M'!P1172","v":0},{"$f":"SUM(C262:L262)","v":0}]
[5300,"EQUIPO E INSTRUMENTAL MÉDICO Y DE LABORATORIO",{"$f":"SUM(C264:C265)","v":0},{"$f":"SUM(D264:D265)","v":0},0,0,0,0,0,0,0,0,0]
[531,"Equipo médico y de laboratorio",{"$f":"'COG-M'!P1174","v":0},{"$f":"'COG-M'!P1175","v":0},null,{"$f":"'COG-M'!P1176","v":0},{"$f":"'COG-M'!P1177","v":0},{"$f":"'COG-M'!P1178","v":0},{"$f":"'COG-M'!P1179","v":0},{"$f":"'COG-M'!P1180","v":0},{"$f":"'COG-M'!P1181","v":0},{"$f":"'COG-M'!P1182","v":0},{"$f":"SUM(C264:L264)","v":0}]
[532,"Instrumental médico y de laboratorio",{"$f":"'COG-M'!P1183","v":0},{"$f":"'COG-M'!P1184","v":0},null,{"$f":"'COG-M'!P1185","v":0},{"$f":"'COG-M'!P1186","v":0},{"$f":"'COG-M'!P1187","v":0},{"$f":"'COG-M'!P1188","v":0},{"$f":"'COG-M'!P1189","v":0},{"$f":"'COG-M'!P1190","v":0},{"$f":"'COG-M'!P1191","v":0},{"$f":"SUM(C265:L265)","v":0}]
[5400,"VEHÍCULOS Y EQUIPO DE TRANSPORTE",{"$f":"SUM(C267:C272)","v":0},{"$f":"SUM(D267:D272)","v":0},0,0,0,0,0,0,0,0,0]
[541,"Vehículos y equipo terrestre",{"$f":"'COG-M'!P1193","v":0},{"$f":"'COG-M'!P1194","v":0},null,{"$f":"'COG-M'!P1195","v":0},{"$f":"'COG-M'!P1196","v":0},{"$f":"'COG-M'!P1197","v":0},{"$f":"'COG-M'!P1198","v":0},{"$f":"'COG-M'!P1199","v":0},{"$f":"'COG-M'!P1200","v":0},{"$f":"'COG-M'!P1201","v":0},{"$f":"SUM(C267:L267)","v":0}]
[542,"Carrocerías  y remolques",{"$f":"'COG-M'!P1202","v":0},{"$f":"'COG-M'!P1203","v":0},null,{"$f":"'COG-M'!P1204","v":0},{"$f":"'COG-M'!P1205","v":0},{"$f":"'COG-M'!P1206","v":0},{"$f":"'COG-M'!P1207","v":0},{"$f":"'COG-M'!P1208","v":0},{"$f":"'COG-M'!P1209","v":0},{"$f":"'COG-M'!P1210","v":0},0]
[543,"Equipo aeroespacial",{"$f":"'COG-M'!P1211","v":0},{"$f":"'COG-M'!P1212","v":0},null,{"$f":"'COG-M'!P1213","v":0},{"$f":"'COG-M'!P1214","v":0},{"$f":"'COG-M'!P1215","v":0},{"$f":"'COG-M'!P1216","v":0},{"$f":"'COG-M'!P1217","v":0},{"$f":"'COG-M'!P1218","v":0},{"$f":"'COG-M'!P1219","v":0},0]
[544,"Equipo ferroviario",{"$f":"'COG-M'!P1220","v":0},{"$f":"'COG-M'!P1221","v":0},null,{"$f":"'COG-M'!P1222","v":0},{"$f":"'COG-M'!P1223","v":0},{"$f":"'COG-M'!P1224","v":0},{"$f":"'COG-M'!P1225","v":0},{"$f":"'COG-M'!P1226","v":0},{"$f":"'COG-M'!P1227","v":0},{"$f":"'COG-M'!P1228","v":0},0]
[545,"Embarcaciones",{"$f":"'COG-M'!P1229","v":0},{"$f":"'COG-M'!P1230","v":0},null,{"$f":"'COG-M'!P1231","v":0},{"$f":"'COG-M'!P1232","v":0},{"$f":"'COG-M'!P1233","v":0},{"$f":"'COG-M'!P1234","v":0},{"$f":"'COG-M'!P1235","v":0},{"$f":"'COG-M'!P1236","v":0},{"$f":"'COG-M'!P1237","v":0},0]
[549,"Otros equipo de transporte",{"$f":"'COG-M'!P1238","v":0},{"$f":"'COG-M'!P1239","v":0},null,{"$f":"'COG-M'!P1240","v":0},{"$f":"'COG-M'!P1241","v":0},{"$f":"'COG-M'!P1242","v":0},{"$f":"'COG-M'!P1243","v":0},{"$f":"'COG-M'!P1244","v":0},{"$f":"'COG-M'!P1245","v":0},{"$f":"'COG-M'!P1246","v":0},0]
[5500,"EQUIPO DE DEFENSA Y SEGURIDAD",{"$f":"SUM(C274)","v":0},{"$f":"SUM(D274)","v":0},0,0,0,0,0,0,0,0,0]
[551,"Equipo de defensa y seguridad",{"$f":"'COG-M'!P1248","v":0},{"$f":"'COG-M'!P1249","v":0},null,{"$f":"'COG-M'!P1250","v":0},{"$f":"'COG-M'!P1251","v":0},{"$f":"'COG-M'!P1252","v":0},{"$f":"'COG-M'!P1253","v":0},{"$f":"'COG-M'!P1254","v":0},{"$f":"'COG-M'!P1255","v":0},{"$f":"'COG-M'!P1256","v":0},{"$f":"SUM(C274:L274)","v":0}]
[5600,"MAQUINARIA, OTROS EQUIPOS Y HERRAMIENTAS",{"$f":"SUM(C276:C283)","v":0},{"$f":"SUM(D276:D283)","v":0},0,0,0,0,0,0,0,0,0]
[561,"Maquinaria y equipo agropecuario",{"$f":"'COG-M'!P1258","v":0},{"$f":"'COG-M'!P1259","v":0},null,{"$f":"'COG-M'!P1260","v":0},{"$f":"'COG-M'!P1261","v":0},{"$f":"'COG-M'!P1262","v":0},{"$f":"'COG-M'!P1263","v":0},{"$f":"'COG-M'!P1264","v":0},{"$f":"'COG-M'!P1265","v":0},{"$f":"'COG-M'!P1266","v":0},{"$f":"SUM(C276:L276)","v":0}]
[562,"Maquinaria y equipo industrial",{"$f":"'COG-M'!P1267","v":0},{"$f":"'COG-M'!P1268","v":0},null,{"$f":"'COG-M'!P1269","v":0},{"$f":"'COG-M'!P1270","v":0},{"$f":"'COG-M'!P1271","v":0},{"$f":"'COG-M'!P1272","v":0},{"$f":"'COG-M'!P1273","v":0},{"$f":"'COG-M'!P1274","v":0},{"$f":"'COG-M'!P1275","v":0},0]
[563,"Maquinaria y equipo de construcción",{"$f":"'COG-M'!P1276","v":0},{"$f":"'COG-M'!P1277","v":0},null,{"$f":"'COG-M'!P1278","v":0},{"$f":"'COG-M'!P1279","v":0},{"$f":"'COG-M'!P1280","v":0},{"$f":"'COG-M'!P1281","v":0},{"$f":"'COG-M'!P1282","v":0},{"$f":"'COG-M'!P1283","v":0},{"$f":"'COG-M'!P1284","v":0},0]
[564,"Sistemas de aire acondicionado, calefacción y de refrigeración industrial y comercial",{"$f":"'COG-M'!P1285","v":0},{"$f":"'COG-M'!P1286","v":0},null,{"$f":"'COG-M'!P1287","v":0},{"$f":"'COG-M'!P1288","v":0},{"$f":"'COG-M'!P1289","v":0},{"$f":"'COG-M'!P1290","v":0},{"$f":"'COG-M'!P1291","v":0},{"$f":"'COG-M'!P1292","v":0},{"$f":"'COG-M'!P1293","v":0},0]
[565,"Equipo de comunicación y telecomunicación",{"$f":"'COG-M'!P1294","v":0},{"$f":"'COG-M'!P1295","v":0},null,{"$f":"'COG-M'!P1296","v":0},{"$f":"'COG-M'!P1297","v":0},{"$f":"'COG-M'!P1298","v":0},{"$f":"'COG-M'!P1299","v":0},{"$f":"'COG-M'!P1300","v":0},{"$f":"'COG-M'!P1301","v":0},{"$f":"'COG-M'!P1302","v":0},0]
[566,"Equipo de generación eléctrica, aparatos y accesorios eléctricos",{"$f":"'COG-M'!P1303","v":0},{"$f":"'COG-M'!P1304","v":0},null,{"$f":"'COG-M'!P1305","v":0},{"$f":"'COG-M'!P1306","v":0},{"$f":"'COG-M'!P1307","v":0},{"$f":"'COG-M'!P1308","v":0},{"$f":"'COG-M'!P1309","v":0},{"$f":"'COG-M'!P1310","v":0},{"$f":"'COG-M'!P1311","v":0},0]
[567,"Herramientas y máquinas-herramienta",{"$f":"'COG-M'!P1312","v":0},{"$f":"'COG-M'!P1313","v":0},null,{"$f":"'COG-M'!P1314","v":0},{"$f":"'COG-M'!P1315","v":0},{"$f":"'COG-M'!P1316","v":0},{"$f":"'COG-M'!P1317","v":0},{"$f":"'COG-M'!P1318","v":0},{"$f":"'COG-M'!P1319","v":0},{"$f":"'COG-M'!P1320","v":0},0]
[569,"Otros equipos",{"$f":"'COG-M'!P1321","v":0},{"$f":"'COG-M'!P1322","v":0},null,{"$f":"'COG-M'!P1323","v":0},{"$f":"'COG-M'!P1324","v":0},{"$f":"'COG-M'!P1325","v":0},{"$f":"'COG-M'!P1326","v":0},{"$f":"'COG-M'!P1327","v":0},{"$f":"'COG-M'!P1328","v":0},{"$f":"'COG-M'!P1329","v":0},0]
[5700,"ACTIVOS BIOLÓGICOS",{"$f":"SUM(C285:C293)","v":0},{"$f":"SUM(D285:D293)","v":0},0,0,0,0,0,0,0,0,0]
[571,"Bovinos",{"$f":"'COG-M'!P1331","v":0},{"$f":"'COG-M'!P1332","v":0},null,{"$f":"'COG-M'!P1333","v":0},{"$f":"'COG-M'!P1334","v":0},{"$f":"'COG-M'!P1335","v":0},{"$f":"'COG-M'!P1336","v":0},{"$f":"'COG-M'!P1337","v":0},{"$f":"'COG-M'!P1338","v":0},{"$f":"'COG-M'!P1339","v":0},{"$f":"SUM(C285:L285)","v":0}]
[572,"Porcinos",{"$f":"'COG-M'!P1340","v":0},{"$f":"'COG-M'!P1341","v":0},null,{"$f":"'COG-M'!P1342","v":0},{"$f":"'COG-M'!P1343","v":0},{"$f":"'COG-M'!P1344","v":0},{"$f":"'COG-M'!P1345","v":0},{"$f":"'COG-M'!P1346","v":0},{"$f":"'COG-M'!P1347","v":0},{"$f":"'COG-M'!P1348","v":0},0]
[573,"Aves",{"$f":"'COG-M'!P1349","v":0},{"$f":"'COG-M'!P1350","v":0},null,{"$f":"'COG-M'!P1351","v":0},{"$f":"'COG-M'!P1352","v":0},{"$f":"'COG-M'!P1353","v":0},{"$f":"'COG-M'!P1354","v":0},{"$f":"'COG-M'!P1355","v":0},{"$f":"'COG-M'!P1356","v":0},{"$f":"'COG-M'!P1357","v":0},0]
[574,"Ovinos y caprinos ",{"$f":"'COG-M'!P1358","v":0},{"$f":"'COG-M'!P1359","v":0},null,{"$f":"'COG-M'!P1360","v":0},{"$f":"'COG-M'!P1361","v":0},{"$f":"'COG-M'!P1362","v":0},{"$f":"'COG-M'!P1363","v":0},{"$f":"'COG-M'!P1364","v":0},{"$f":"'COG-M'!P1365","v":0},{"$f":"'COG-M'!P1366","v":0},0]
[575,"Peces y acuicultura",{"$f":"'COG-M'!P1367","v":0},{"$f":"'COG-M'!P1368","v":0},null,{"$f":"'COG-M'!P1369","v":0},{"$f":"'COG-M'!P1370","v":0},{"$f":"'COG-M'!P1371","v":0},{"$f":"'COG-M'!P1372","v":0},{"$f":"'COG-M'!P1373","v":0},{"$f":"'COG-M'!P1374","v":0},{"$f":"'COG-M'!P1375","v":0},0]
[576,"Equinos",{"$f":"'COG-M'!P1376","v":0},{"$f":"'COG-M'!P1377","v":0},null,{"$f":"'COG-M'!P1378","v":0},{"$f":"'COG-M'!P1379","v":0},{"$f":"'COG-M'!P1380","v":0},{"$f":"'COG-M'!P1381","v":0},{"$f":"'COG-M'!P1382","v":0},{"$f":"'COG-M'!P1383","v":0},{"$f":"'COG-M'!P1384","v":0},0]
[577,"Especies menores y de zoológico",{"$f":"'COG-M'!P1385","v":0},{"$f":"'COG-M'!P1386","v":0},null,{"$f":"'COG-M'!P1387","v":0},{"$f":"'COG-M'!P1388","v":0},{"$f":"'COG-M'!P1389","v":0},{"$f":"'COG-M'!P1390","v":0},{"$f":"'COG-M'!P1391","v":0},{"$f":"'COG-M'!P1392","v":0},{"$f":"'COG-M'!P1393","v":0},0]
[578,"Árboles y plantas",{"$f":"'COG-M'!P1394","v":0},{"$f":"'COG-M'!P1395","v":0},null,{"$f":"'COG-M'!P1396","v":0},{"$f":"'COG-M'!P1397","v":0},{"$f":"'COG-M'!P1398","v":0},{"$f":"'COG-M'!P1399","v":0},{"$f":"'COG-M'!P1400","v":0},{"$f":"'COG-M'!P1401","v":0},{"$f":"'COG-M'!P1402","v":0},0]
[579,"Otros activos biológicos",{"$f":"'COG-M'!P1403","v":0},{"$f":"'COG-M'!P1404","v":0},null,{"$f":"'COG-M'!P1405","v":0},{"$f":"'COG-M'!P1406","v":0},{"$f":"'COG-M'!P1407","v":0},{"$f":"'COG-M'!P1408","v":0},{"$f":"'COG-M'!P1409","v":0},{"$f":"'COG-M'!P1410","v":0},{"$f":"'COG-M'!P1411","v":0},0]
[5800,"BIENES INMUEBLES",{"$f":"SUM(C295:C298)","v":0},{"$f":"SUM(D295:D298)","v":0},0,0,0,0,0,0,0,0,0]
[581,"Terrenos",{"$f":"'COG-M'!P1413","v":0},{"$f":"'COG-M'!P1414","v":0},null,{"$f":"'COG-M'!P1415","v":0},{"$f":"'COG-M'!P1416","v":0},{"$f":"'COG-M'!P1417","v":0},{"$f":"'COG-M'!P1418","v":0},{"$f":"'COG-M'!P1419","v":0},{"$f":"'COG-M'!P1420","v":0},{"$f":"'COG-M'!P1421","v":0},{"$f":"SUM(C295:L295)","v":0}]
[582,"Viviendas ",{"$f":"'COG-M'!P1422","v":0},{"$f":"'COG-M'!P1423","v":0},null,{"$f":"'COG-M'!P1424","v":0},{"$f":"'COG-M'!P1425","v":0},{"$f":"'COG-M'!P1426","v":0},{"$f":"'COG-M'!P1427","v":0},{"$f":"'COG-M'!P1428","v":0},{"$f":"'COG-M'!P1429","v":0},{"$f":"'COG-M'!P1430","v":0},{"$f":"SUM(C296:L296)","v":0}]
[583,"Edificios no residenciales",{"$f":"'COG-M'!P1431","v":0},{"$f":"'COG-M'!P1432","v":0},null,{"$f":"'COG-M'!P1433","v":0},{"$f":"'COG-M'!P1434","v":0},{"$f":"'COG-M'!P1435","v":0},{"$f":"'COG-M'!P1436","v":0},{"$f":"'COG-M'!P1437","v":0},{"$f":"'COG-M'!P1438","v":0},{"$f":"'COG-M'!P1439","v":0},{"$f":"SUM(C297:L297)","v":0}]
[589,"Otros bienes inmuebles",{"$f":"'COG-M'!P1440","v":0},{"$f":"'COG-M'!P1441","v":0},null,{"$f":"'COG-M'!P1442","v":0},{"$f":"'COG-M'!P1443","v":0},{"$f":"'COG-M'!P1444","v":0},{"$f":"'COG-M'!P1445","v":0},{"$f":"'COG-M'!P1446","v":0},{"$f":"'COG-M'!P1447","v":0},{"$f":"'COG-M'!P1448","v":0},{"$f":"SUM(C298:L298)","v":0}]
[5900,"ACTIVOS INTANGIBLES",{"$f":"SUM(C300:C308)","v":0},{"$f":"SUM(D300:D308)","v":0},0,0,0,0,0,0,0,0,0]
[591,"Software",{"$f":"'COG-M'!P1450","v":0},{"$f":"'COG-M'!P1451","v":0},null,{"$f":"'COG-M'!P1452","v":0},{"$f":"'COG-M'!P1453","v":0},{"$f":"'COG-M'!P1454","v":0},{"$f":"'COG-M'!P1455","v":0},{"$f":"'COG-M'!P1456","v":0},{"$f":"'COG-M'!P1457","v":0},{"$f":"'COG-M'!P1458","v":0},{"$f":"SUM(C300:L300)","v":0}]
[592,"Patentes",{"$f":"'COG-M'!P1459","v":0},{"$f":"'COG-M'!P1460","v":0},null,{"$f":"'COG-M'!P1461","v":0},{"$f":"'COG-M'!P1462","v":0},{"$f":"'COG-M'!P1463","v":0},{"$f":"'COG-M'!P1464","v":0},{"$f":"'COG-M'!P1465","v":0},{"$f":"'COG-M'!P1466","v":0},{"$f":"'COG-M'!P1467","v":0},0]
[593,"Marcas",{"$f":"'COG-M'!P1468","v":0},{"$f":"'COG-M'!P1469","v":0},null,{"$f":"'COG-M'!P1470","v":0},{"$f":"'COG-M'!P1471","v":0},{"$f":"'COG-M'!P1472","v":0},{"$f":"'COG-M'!P1473","v":0},{"$f":"'COG-M'!P1474","v":0},{"$f":"'COG-M'!P1475","v":0},{"$f":"'COG-M'!P1476","v":0},0]
[594,"Derechos",{"$f":"'COG-M'!P1477","v":0},{"$f":"'COG-M'!P1478","v":0},null,{"$f":"'COG-M'!P1479","v":0},{"$f":"'COG-M'!P1480","v":0},{"$f":"'COG-M'!P1481","v":0},{"$f":"'COG-M'!P1482","v":0},{"$f":"'COG-M'!P1483","v":0},{"$f":"'COG-M'!P1484","v":0},{"$f":"'COG-M'!P1485","v":0},0]
[595,"Concesiones",{"$f":"'COG-M'!P1486","v":0},{"$f":"'COG-M'!P1487","v":0},null,{"$f":"'COG-M'!P1488","v":0},{"$f":"'COG-M'!P1489","v":0},{"$f":"'COG-M'!P1490","v":0},{"$f":"'COG-M'!P1491","v":0},{"$f":"'COG-M'!P1492","v":0},{"$f":"'COG-M'!P1493","v":0},{"$f":"'COG-M'!P1494","v":0},0]
[596,"Franquicias",{"$f":"'COG-M'!P1495","v":0},{"$f":"'COG-M'!P1496","v":0},null,{"$f":"'COG-M'!P1497","v":0},{"$f":"'COG-M'!P1498","v":0},{"$f":"'COG-M'!P1499","v":0},{"$f":"'COG-M'!P1500","v":0},{"$f":"'COG-M'!P1501","v":0},{"$f":"'COG-M'!P1502","v":0},{"$f":"'COG-M'!P1503","v":0},0]
[597,"Licencias informáticas e intelectuales",{"$f":"'COG-M'!P1504","v":0},{"$f":"'COG-M'!P1505","v":0},null,{"$f":"'COG-M'!P1506","v":0},{"$f":"'COG-M'!P1507","v":0},{"$f":"'COG-M'!P1508","v":0},{"$f":"'COG-M'!P1509","v":0},{"$f":"'COG-M'!P1510","v":0},{"$f":"'COG-M'!P1511","v":0},{"$f":"'COG-M'!P1512","v":0},0]
[598,"Licencias industriales, comerciales y otras",{"$f":"'COG-M'!P1513","v":0},{"$f":"'COG-M'!P1514","v":0},null,{"$f":"'COG-M'!P1515","v":0},{"$f":"'COG-M'!P1516","v":0},{"$f":"'COG-M'!P1517","v":0},{"$f":"'COG-M'!P1518","v":0},{"$f":"'COG-M'!P1519","v":0},{"$f":"'COG-M'!P1520","v":0},{"$f":"'COG-M'!P1521","v":0},0]
[599,"Otros activos intangibles",{"$f":"'COG-M'!P1522","v":0},{"$f":"'COG-M'!P1523","v":0},null,{"$f":"'COG-M'!P1524","v":0},{"$f":"'COG-M'!P1525","v":0},{"$f":"'COG-M'!P1526","v":0},{"$f":"'COG-M'!P1527","v":0},{"$f":"'COG-M'!P1528","v":0},{"$f":"'COG-M'!P1529","v":0},{"$f":"'COG-M'!P1530","v":0},0]
[6000,"INVERSIÓN PÚBLICA",{"$f":"C310+C319+C328","v":0},{"$f":"D310+D319+D328","v":0},0,0,0,0,0,0,0,0,0]
[6100,"OBRA PÚBLICA EN BIENES DE DOMINIO PÚBLICO",{"$f":"SUM(C311:C318)","v":0},{"$f":"SUM(D311:D318)","v":0},0,0,0,0,0,0,0,0,0]
[611,"Edificación habitacional",{"$f":"'COG-M'!P1533","v":0},{"$f":"'COG-M'!P1534","v":0},null,{"$f":"'COG-M'!P1535","v":0},{"$f":"'COG-M'!P1536","v":0},{"$f":"'COG-M'!P1537","v":0},{"$f":"'COG-M'!P1538","v":0},{"$f":"'COG-M'!P1539","v":0},{"$f":"'COG-M'!P1540","v":0},{"$f":"'COG-M'!P1541","v":0},{"$f":"SUM(C311:L311)","v":0}]
[612,"Edificación no  habitacional",{"$f":"'COG-M'!P1542","v":0},{"$f":"'COG-M'!P1543","v":0},null,{"$f":"'COG-M'!P1544","v":0},{"$f":"'COG-M'!P1545","v":0},{"$f":"'COG-M'!P1546","v":0},{"$f":"'COG-M'!P1547","v":0},{"$f":"'COG-M'!P1548","v":0},{"$f":"'COG-M'!P1549","v":0},{"$f":"'COG-M'!P1550","v":0},0]
[613,"Construcción de obras para el abastecimiento de agua, petróleo, gas, electricidad y telecomunicaciones",{"$f":"'COG-M'!P1551","v":0},{"$f":"'COG-M'!P1552","v":0},null,{"$f":"'COG-M'!P1553","v":0},{"$f":"'COG-M'!P1554","v":0},{"$f":"'COG-M'!P1555","v":0},{"$f":"'COG-M'!P1556","v":0},{"$f":"'COG-M'!P1557","v":0},{"$f":"'COG-M'!P1558","v":0},{"$f":"'COG-M'!P1559","v":0},0]
[614,"División de terrenos y construcción de obras de urbanización",{"$f":"'COG-M'!P1560","v":0},{"$f":"'COG-M'!P1561","v":0},null,{"$f":"'COG-M'!P1562","v":0},{"$f":"'COG-M'!P1563","v":0},{"$f":"'COG-M'!P1564","v":0},{"$f":"'COG-M'!P1565","v":0},{"$f":"'COG-M'!P1566","v":0},{"$f":"'COG-M'!P1567","v":0},{"$f":"'COG-M'!P1568","v":0},0]
[615,"Construcción de vías de comunicación",{"$f":"'COG-M'!P1569","v":0},{"$f":"'COG-M'!P1570","v":0},null,{"$f":"'COG-M'!P1571","v":0},{"$f":"'COG-M'!P1572","v":0},{"$f":"'COG-M'!P1573","v":0},{"$f":"'COG-M'!P1574","v":0},{"$f":"'COG-M'!P1575","v":0},{"$f":"'COG-M'!P1576","v":0},{"$f":"'COG-M'!P1577","v":0},0]
[616,"Otras construcciones de ingeniería civil u obra pesada",{"$f":"'COG-M'!P1578","v":0},{"$f":"'COG-M'!P1579","v":0},null,{"$f":"'COG-M'!P1580","v":0},{"$f":"'COG-M'!P1581","v":0},{"$f":"'COG-M'!P1582","v":0},{"$f":"'COG-M'!P1583","v":0},{"$f":"'COG-M'!P1584","v":0},{"$f":"'COG-M'!P1585","v":0},{"$f":"'COG-M'!P1586","v":0},0]
[617,"Instalaciones y equipamiento en construcciones",{"$f":"'COG-M'!P1587","v":0},{"$f":"'COG-M'!P1588","v":0},null,{"$f":"'COG-M'!P1589","v":0},{"$f":"'COG-M'!P1590","v":0},{"$f":"'COG-M'!P1591","v":0},{"$f":"'COG-M'!P1592","v":0},{"$f":"'COG-M'!P1593","v":0},{"$f":"'COG-M'!P1594","v":0},{"$f":"'COG-M'!P1595","v":0},0]
[619,"Trabajo de acabados en edificaciones y otros trabajos especializados",{"$f":"'COG-M'!P1596","v":0},{"$f":"'COG-M'!P1597","v":0},null,{"$f":"'COG-M'!P1598","v":0},{"$f":"'COG-M'!P1599","v":0},{"$f":"'COG-M'!P1600","v":0},{"$f":"'COG-M'!P1601","v":0},{"$f":"'COG-M'!P1602","v":0},{"$f":"'COG-M'!P1603","v":0},{"$f":"'COG-M'!P1604","v":0},0]
[6200,"OBRA PÚBLICA EN BIENES PROPIOS",{"$f":"SUM(C320:C327)","v":0},{"$f":"SUM(D320:D327)","v":0},0,0,0,0,0,0,0,0,0]
[621,"Edificación habitacional",{"$f":"'COG-M'!P1606","v":0},{"$f":"'COG-M'!P1607","v":0},null,{"$f":"'COG-M'!P1608","v":0},{"$f":"'COG-M'!P1609","v":0},{"$f":"'COG-M'!P1610","v":0},{"$f":"'COG-M'!P1611","v":0},{"$f":"'COG-M'!P1612","v":0},{"$f":"'COG-M'!P1613","v":0},{"$f":"'COG-M'!P1614","v":0},{"$f":"SUM(C320:L320)","v":0}]
[622,"Edificación no habitacional",{"$f":"'COG-M'!P1615","v":0},{"$f":"'COG-M'!P1616","v":0},null,{"$f":"'COG-M'!P1617","v":0},{"$f":"'COG-M'!P1618","v":0},{"$f":"'COG-M'!P1619","v":0},{"$f":"'COG-M'!P1620","v":0},{"$f":"'COG-M'!P1621","v":0},{"$f":"'COG-M'!P1622","v":0},{"$f":"'COG-M'!P1623","v":0},0]
[623,"Construcción de obras para  el abastecimiento de agua,  petróleo, gas, electricidad y telecomunicaciones",{"$f":"'COG-M'!P1624","v":0},{"$f":"'COG-M'!P1625","v":0},null,{"$f":"'COG-M'!P1626","v":0},{"$f":"'COG-M'!P1627","v":0},{"$f":"'COG-M'!P1628","v":0},{"$f":"'COG-M'!P1629","v":0},{"$f":"'COG-M'!P1630","v":0},{"$f":"'COG-M'!P1631","v":0},{"$f":"'COG-M'!P1632","v":0},0]
[624,"División de terrenos y construcción de obras de urbanización",{"$f":"'COG-M'!P1633","v":0},{"$f":"'COG-M'!P1634","v":0},null,{"$f":"'COG-M'!P1635","v":0},{"$f":"'COG-M'!P1636","v":0},{"$f":"'COG-M'!P1637","v":0},{"$f":"'COG-M'!P1638","v":0},{"$f":"'COG-M'!P1639","v":0},{"$f":"'COG-M'!P1640","v":0},{"$f":"'COG-M'!P1641","v":0},0]
[625,"Construcción de vías de comunicación",{"$f":"'COG-M'!P1642","v":0},{"$f":"'COG-M'!P1643","v":0},null,{"$f":"'COG-M'!P1644","v":0},{"$f":"'COG-M'!P1645","v":0},{"$f":"'COG-M'!P1646","v":0},{"$f":"'COG-M'!P1647","v":0},{"$f":"'COG-M'!P1648","v":0},{"$f":"'COG-M'!P1649","v":0},{"$f":"'COG-M'!P1650","v":0},0]
[626,"Otras construcciones de ingeniería civil u obra pesada",{"$f":"'COG-M'!P1651","v":0},{"$f":"'COG-M'!P1652","v":0},null,{"$f":"'COG-M'!P1653","v":0},{"$f":"'COG-M'!P1654","v":0},{"$f":"'COG-M'!P1655","v":0},{"$f":"'COG-M'!P1656","v":0},{"$f":"'COG-M'!P1657","v":0},{"$f":"'COG-M'!P1658","v":0},{"$f":"'COG-M'!P1659","v":0},0]
[627,"Instalaciones y equipamiento en construcciones",{"$f":"'COG-M'!P1660","v":0},{"$f":"'COG-M'!P1661","v":0},null,{"$f":"'COG-M'!P1662","v":0},{"$f":"'COG-M'!P1663","v":0},{"$f":"'COG-M'!P1664","v":0},{"$f":"'COG-M'!P1665","v":0},{"$f":"'COG-M'!P1666","v":0},{"$f":"'COG-M'!P1667","v":0},{"$f":"'COG-M'!P1668","v":0},0]
[629,"Trabajos de acabados en edificaciones y otros trabajos especializados",{"$f":"'COG-M'!P1669","v":0},{"$f":"'COG-M'!P1670","v":0},null,{"$f":"'COG-M'!P1671","v":0},{"$f":"'COG-M'!P1672","v":0},{"$f":"'COG-M'!P1673","v":0},{"$f":"'COG-M'!P1674","v":0},{"$f":"'COG-M'!P1675","v":0},{"$f":"'COG-M'!P1676","v":0},{"$f":"'COG-M'!P1677","v":0},0]
[6300,"PROYECTOS PRODUCTIVOS Y ACCIONES DE FOMENTO",{"$f":"SUM(C329:C330)","v":0},{"$f":"SUM(D329:D330)","v":0},0,0,0,0,0,0,0,0,0]
[631,"Estudios, formulación y evaluación de proyectos productivos no incluidos en conceptos anteriores de este capítulo",{"$f":"'COG-M'!P1679","v":0},{"$f":"'COG-M'!P1680","v":0},null,{"$f":"'COG-M'!P1681","v":0},{"$f":"'COG-M'!P1682","v":0},{"$f":"'COG-M'!P1683","v":0},{"$f":"'COG-M'!P1684","v":0},{"$f":"'COG-M'!P1685","v":0},{"$f":"'COG-M'!P1686","v":0},{"$f":"'COG-M'!P1687","v":0},{"$f":"SUM(C329:L329)","v":0}]
[632,"Ejecución de proyectos productivos no incluidos en conceptos anteriores de este capítulo",{"$f":"'COG-M'!P1688","v":0},{"$f":"'COG-M'!P1689","v":0},null,{"$f":"'COG-M'!P1690","v":0},{"$f":"'COG-M'!P1691","v":0},{"$f":"'COG-M'!P1692","v":0},{"$f":"'COG-M'!P1693","v":0},{"$f":"'COG-M'!P1694","v":0},{"$f":"'COG-M'!P1695","v":0},{"$f":"'COG-M'!P1696","v":0},{"$f":"SUM(C330:L330)","v":0}]
[7000,"INVERSIONES FINANCIERAS Y OTRAS PROVISIONES",{"$f":"C332+C335+C345+C352+C362+C372+C375","v":0},{"$f":"D332+D335+D345+D352+D362+D372+D375","v":0},0,0,0,0,0,0,0,0,0]
[7100,"INVERSIONES PARA EL FOMENTO DE ACTIVIDADES PRODUCTIVAS",{"$f":"SUM(C333:C334)","v":0},{"$f":"SUM(D333:D334)","v":0},0,0,0,0,0,0,0,0,0]
[711,"Créditos otorgados por entidades federativas y municipios al sector social y privado para el fomento de actividades productivas",{"$f":"'COG-M'!P1699","v":0},{"$f":"'COG-M'!P1700","v":0},null,{"$f":"'COG-M'!P1701","v":0},{"$f":"'COG-M'!P1702","v":0},{"$f":"'COG-M'!P1703","v":0},{"$f":"'COG-M'!P1704","v":0},{"$f":"'COG-M'!P1705","v":0},{"$f":"'COG-M'!P1706","v":0},{"$f":"'COG-M'!P1707","v":0},{"$f":"SUM(C333:L333)","v":0}]
[712,"Créditos otorgados por las entidades federativas a municipios para el fomento de actividades productivas",{"$nulls":10},{"$f":"SUM(C334:L334)","v":0}]
[7200,"ACCIONES Y PARTICIPACIONES DE CAPITAL",{"$f":"SUM(C336:C344)","v":0},{"$f":"SUM(D336:D344)","v":0},0,0,0,0,0,0,0,0,0]
[721,"Acciones y participaciones de capital en entidades paraestatales no empresariales y no financieras con fines de política económica",{"$f":"'COG-M'!P1710","v":0},{"$f":"'COG-M'!P1711","v":0},null,{"$f":"'COG-M'!P1712","v":0},{"$f":"'COG-M'!P1713","v":0},{"$f":"'COG-M'!P1714","v":0},{"$f":"'COG-M'!P1715","v":0},{"$f":"'COG-M'!P1716","v":0},{"$f":"'COG-M'!P1717","v":0},{"$f":"'COG-M'!P1718","v":0},{"$f":"SUM(C336:L336)","v":0}]
[722,"Acciones y participaciones de capital en entidades paraestatales empresariales y no financieras con fines de política económica",{"$nulls":10},0]
[723,"Acciones  y participaciones de capital en instituciones paraestatales públicas financieras con fines de política económica",{"$nulls":10},0]
[724,"Acciones y participaciones  de capital en el sector privado con fines de política económica",{"$f":"'COG-M'!P1721","v":0},{"$f":"'COG-M'!P1722","v":0},null,{"$f":"'COG-M'!P1723","v":0},{"$f":"'COG-M'!P1724","v":0},{"$f":"'COG-M'!P1725","v":0},{"$f":"'COG-M'!P1726","v":0},{"$f":"'COG-M'!P1727","v":0},{"$f":"'COG-M'!P1728","v":0},{"$f":"'COG-M'!P1729","v":0},0]
[725,"Acciones y participaciones de capital en organismos internacionales con fines de política económica",{"$f":"'COG-M'!P1730","v":0},{"$f":"'COG-M'!P1731","v":0},null,{"$f":"'COG-M'!P1732","v":0},{"$f":"'COG-M'!P1733","v":0},{"$f":"'COG-M'!P1734","v":0},{"$f":"'COG-M'!P1735","v":0},{"$f":"'COG-M'!P1736","v":0},{"$f":"'COG-M'!P1737","v":0},{"$f":"'COG-M'!P1738","v":0},0]
[726,"Acciones y participaciones de capital en el sector externo con fines de política económica",{"$f":"'COG-M'!P1739","v":0},{"$f":"'COG-M'!P1740","v":0},null,{"$f":"'COG-M'!P1741","v":0},{"$f":"'COG-M'!P1742","v":0},{"$f":"'COG-M'!P1743","v":0},{"$f":"'COG-M'!P1744","v":0},{"$f":"'COG-M'!P1745","v":0},{"$f":"'COG-M'!P1746","v":0},{"$f":"'COG-M'!P1747","v":0},0]
[727,"Acciones y participaciones de capital en el sector público con fines de gestión de la liquidez",{"$f":"'COG-M'!P1748","v":0},{"$f":"'COG-M'!P1749","v":0},null,{"$f":"'COG-M'!P1750","v":0},{"$f":"'COG-M'!P1751","v":0},{"$f":"'COG-M'!P1752","v":0},{"$f":"'COG-M'!P1753","v":0},{"$f":"'COG-M'!P1754","v":0},{"$f":"'COG-M'!P1755","v":0},{"$f":"'COG-M'!P1756","v":0},0]
[728,"Acciones y participaciones de capital  en el sector privado con fines de gestión de liquidez",{"$f":"'COG-M'!P1757","v":0},{"$f":"'COG-M'!P1758","v":0},null,{"$f":"'COG-M'!P1759","v":0},{"$f":"'COG-M'!P1760","v":0},{"$f":"'COG-M'!P1761","v":0},{"$f":"'COG-M'!P1762","v":0},{"$f":"'COG-M'!P1763","v":0},{"$f":"'COG-M'!P1764","v":0},{"$f":"'COG-M'!P1765","v":0},0]
[729,"Acciones y participaciones de capital en el sector externo con fines de gestión  de liquidez",{"$f":"'COG-M'!P1766","v":0},{"$f":"'COG-M'!P1767","v":0},null,{"$f":"'COG-M'!P1768","v":0},{"$f":"'COG-M'!P1769","v":0},{"$f":"'COG-M'!P1770","v":0},{"$f":"'COG-M'!P1771","v":0},{"$f":"'COG-M'!P1772","v":0},{"$f":"'COG-M'!P1773","v":0},{"$f":"'COG-M'!P1774","v":0},0]
[7300,"COMPRA DE TÍTULOS Y VALORES",{"$f":"SUM(C346:C351)","v":0},{"$f":"SUM(D346:D351)","v":0},0,0,0,0,0,0,0,0,0]
[731,"Bonos",{"$f":"'COG-M'!P1776","v":0},null,null,{"$f":"'COG-M'!P1777","v":0},{"$f":"'COG-M'!P1778","v":0},{"$f":"'COG-M'!P1779","v":0},{"$f":"'COG-M'!P1780","v":0},{"$f":"'COG-M'!P1781","v":0},{"$f":"'COG-M'!P1782","v":0},{"$f":"'COG-M'!P1783","v":0},{"$f":"SUM(C346:L346)","v":0}]
[732,"Valores representativos de deuda adquiridos con fines de política económica",{"$f":"'COG-M'!P1784","v":0},null,null,{"$f":"'COG-M'!P1785","v":0},{"$f":"'COG-M'!P1786","v":0},{"$f":"'COG-M'!P1787","v":0},{"$f":"'COG-M'!P1788","v":0},{"$f":"'COG-M'!P1789","v":0},{"$f":"'COG-M'!P1790","v":0},{"$f":"'COG-M'!P1791","v":0},0]
[733,"Valores representativos de deuda  adquiridos con fines de gestión de liquidez",{"$f":"'COG-M'!P1792","v":0},null,null,{"$f":"'COG-M'!P1793","v":0},{"$f":"'COG-M'!P1794","v":0},{"$f":"'COG-M'!P1795","v":0},{"$f":"'COG-M'!P1796","v":0},{"$f":"'COG-M'!P1797","v":0},{"$f":"'COG-M'!P1798","v":0},{"$f":"'COG-M'!P1799","v":0},0]
[734,"Obligaciones negociables adquiridas con fines de política económica",{"$f":"'COG-M'!P1800","v":0},null,null,{"$f":"'COG-M'!P1801","v":0},{"$f":"'COG-M'!P1802","v":0},{"$f":"'COG-M'!P1803","v":0},{"$f":"'COG-M'!P1804","v":0},{"$f":"'COG-M'!P1805","v":0},{"$f":"'COG-M'!P1806","v":0},{"$f":"'COG-M'!P1807","v":0},0]
[735,"Obligaciones negociables adquiridas con fines de gestión de liquidez",{"$f":"'COG-M'!P1808","v":0},null,null,{"$f":"'COG-M'!P1809","v":0},{"$f":"'COG-M'!P1810","v":0},{"$f":"'COG-M'!P1811","v":0},{"$f":"'COG-M'!P1812","v":0},{"$f":"'COG-M'!P1813","v":0},{"$f":"'COG-M'!P1814","v":0},{"$f":"'COG-M'!P1815","v":0},0]
[739,"Otros valores",{"$f":"'COG-M'!P1816","v":0},null,null,{"$f":"'COG-M'!P1817","v":0},{"$f":"'COG-M'!P1818","v":0},{"$f":"'COG-M'!P1819","v":0},{"$f":"'COG-M'!P1820","v":0},{"$f":"'COG-M'!P1821","v":0},{"$f":"'COG-M'!P1822","v":0},{"$f":"'COG-M'!P1823","v":0},0]
[7400,"CONCESIÓN DE PRÉSTAMOS",{"$f":"SUM(C353:C361)","v":0},{"$f":"SUM(D353:D361)","v":0},0,0,0,0,0,0,0,0,0]
[741,"Concesión de préstamos a entidades paraestatales no empresariales y no financieras con fines de política económica",{"$f":"'COG-M'!P1825","v":0},null,null,{"$f":"'COG-M'!P1826","v":0},{"$f":"'COG-M'!P1827","v":0},{"$f":"'COG-M'!P1828","v":0},{"$f":"'COG-M'!P1829","v":0},{"$f":"'COG-M'!P1830","v":0},{"$f":"'COG-M'!P1831","v":0},{"$f":"'COG-M'!P1832","v":0},{"$f":"SUM(C353:L353)","v":0}]
[742,"Concesión de préstamos a entidades paraestatales empresariales y no financieras con fines de política económica",{"$nulls":10},0]
[743,"Concesión de préstamos a instituciones paraestatales públicas financieras con fines de política económica",{"$nulls":10},0]
[744,"Concesión de préstamos a entidades federativas  y municipios con fines de política económica",{"$nulls":10},0]
[745,"Concesión de préstamos al sector privado con fines de política económica",{"$f":"'COG-M'!P1836","v":0},null,null,{"$f":"'COG-M'!P1837","v":0},{"$f":"'COG-M'!P1838","v":0},{"$f":"'COG-M'!P1839","v":0},{"$f":"'COG-M'!P1840","v":0},{"$f":"'COG-M'!P1841","v":0},{"$f":"'COG-M'!P1842","v":0},{"$f":"'COG-M'!P1843","v":0},0]
[746,"Concesión de préstamos al sector externo con fines de política económica",{"$f":"'COG-M'!P1844","v":0},null,null,{"$f":"'COG-M'!P1845","v":0},{"$f":"'COG-M'!P1846","v":0},{"$f":"'COG-M'!P1847","v":0},{"$f":"'COG-M'!P1848","v":0},{"$f":"'COG-M'!P1849","v":0},{"$f":"'COG-M'!P1850","v":0},{"$f":"'COG-M'!P1851","v":0},0]
[747,"Concesión de préstamos al sector público con fines de gestión de liquidez",{"$f":"'COG-M'!P1852","v":0},null,null,{"$f":"'COG-M'!P1853","v":0},{"$f":"'COG-M'!P1854","v":0},{"$f":"'COG-M'!P1855","v":0},{"$f":"'COG-M'!P1856","v":0},{"$f":"'COG-M'!P1857","v":0},{"$f":"'COG-M'!P1858","v":0},{"$f":"'COG-M'!P1859","v":0},0]
[748,"Concesión de préstamos al sector privado con fines de gestión de liquidez",{"$f":"'COG-M'!P1860","v":0},null,null,{"$f":"'COG-M'!P1861","v":0},{"$f":"'COG-M'!P1862","v":0},{"$f":"'COG-M'!P1863","v":0},{"$f":"'COG-M'!P1864","v":0},{"$f":"'COG-M'!P1865","v":0},{"$f":"'COG-M'!P1866","v":0},{"$f":"'COG-M'!P1867","v":0},0]
[749,"Concesión de  préstamos al sector externo con fines de gestión de liquidez",{"$f":"'COG-M'!P1868","v":0},null,null,{"$f":"'COG-M'!P1869","v":0},{"$f":"'COG-M'!P1870","v":0},{"$f":"'COG-M'!P1871","v":0},{"$f":"'COG-M'!P1872","v":0},{"$f":"'COG-M'!P1873","v":0},{"$f":"'COG-M'!P1874","v":0},{"$f":"'COG-M'!P1875","v":0},0]
[7500,"INVERSIONES EN FIDEICOMISOS, MANDATOS Y OTROS  ANÁLOGOS",{"$f":"SUM(C363:C371)","v":0},{"$f":"SUM(D363:D371)","v":0},0,0,0,0,0,0,0,0,0]
[751,"Inversiones en fideicomisos del Poder Ejecutivo",{"$f":"'COG-M'!P1877","v":0},null,null,{"$f":"'COG-M'!P1878","v":0},{"$f":"'COG-M'!P1879","v":0},{"$f":"'COG-M'!P1880","v":0},{"$f":"'COG-M'!P1881","v":0},{"$f":"'COG-M'!P1882","v":0},{"$f":"'COG-M'!P1883","v":0},{"$f":"'COG-M'!P1884","v":0},{"$f":"SUM(C363:L363)","v":0}]
[752,"Inversiones en fideicomisos del Poder Legislativo",{"$nulls":10},0]
[753,"Inversiones en fideicomisos del Poder Judicial",{"$nulls":10},0]
[754,"Inversiones en fideicomisos públicos no empresariales y no financieros",{"$f":"'COG-M'!P1887","v":0},null,null,{"$f":"'COG-M'!P1888","v":0},{"$f":"'COG-M'!P1889","v":0},{"$f":"'COG-M'!P1890","v":0},{"$f":"'COG-M'!P1891","v":0},{"$f":"'COG-M'!P1892","v":0},{"$f":"'COG-M'!P1893","v":0},{"$f":"'COG-M'!P1894","v":0},0]
[755,"Inversiones en fideicomisos públicos empresariales y no financieros",{"$nulls":10},0]
[756,"Inversiones en fideicomisos públicos financieros ",{"$nulls":10},0]
[757,"Inversiones en fideicomisos de entidades federativas",{"$f":"'COG-M'!P1897","v":0},null,null,{"$f":"'COG-M'!P1898","v":0},{"$f":"'COG-M'!P1899","v":0},{"$f":"'COG-M'!P1900","v":0},{"$f":"'COG-M'!P1901","v":0},{"$f":"'COG-M'!P1902","v":0},{"$f":"'COG-M'!P1903","v":0},{"$f":"'COG-M'!P1904","v":0},0]
[758,"Inversiones en fideicomisos de municipios",{"$nulls":10},0]
[759,"Otras inversiones en fideicomisos",{"$f":"'COG-M'!P1906","v":0},null,null,{"$f":"'COG-M'!P1907","v":0},{"$f":"'COG-M'!P1908","v":0},{"$f":"'COG-M'!P1909","v":0},{"$f":"'COG-M'!P1910","v":0},{"$f":"'COG-M'!P1911","v":0},{"$f":"'COG-M'!P1912","v":0},{"$f":"'COG-M'!P1913","v":0},0]
[7600,"OTRAS INVERSIONES FINANCIERAS",{"$f":"SUM(C373:C374)","v":0},{"$f":"SUM(D373:D374)","v":0},0,0,0,0,0,0,0,0,0]
[761,"Depósitos a largo plazo en moneda nacional",{"$f":"'COG-M'!P1915","v":0},null,null,{"$f":"'COG-M'!P1916","v":0},{"$f":"'COG-M'!P1917","v":0},{"$f":"'COG-M'!P1918","v":0},{"$f":"'COG-M'!P1919","v":0},{"$f":"'COG-M'!P1920","v":0},{"$f":"'COG-M'!P1921","v":0},{"$f":"'COG-M'!P1922","v":0},{"$f":"SUM(C373:L373)","v":0}]
[762,"Depósitos a largo plazo en moneda extranjera",{"$f":"'COG-M'!P1923","v":0},null,null,{"$f":"'COG-M'!P1924","v":0},{"$f":"'COG-M'!P1925","v":0},{"$f":"'COG-M'!P1926","v":0},{"$f":"'COG-M'!P1927","v":0},{"$f":"'COG-M'!P1928","v":0},{"$f":"'COG-M'!P1929","v":0},{"$f":"'COG-M'!P1930","v":0},{"$f":"SUM(C374:L374)","v":0}]
[7900,"PROVISIONES PARA CONTINGENCIAS Y OTRAS EROGACIONES ESPECIALES",{"$f":"SUM(C376:C378)","v":0},{"$f":"SUM(D376:D378)","v":0},0,0,0,0,0,0,0,0,0]
[791,"Contingencias por fenómenos naturales",{"$f":"'COG-M'!P1932","v":0},null,null,{"$f":"'COG-M'!P1933","v":0},{"$f":"'COG-M'!P1934","v":0},{"$f":"'COG-M'!P1935","v":0},{"$f":"'COG-M'!P1936","v":0},{"$f":"'COG-M'!P1937","v":0},{"$f":"'COG-M'!P1938","v":0},{"$f":"'COG-M'!P1939","v":0},{"$f":"SUM(C376:L376)","v":0}]
[792,"Contingencias socioeconómicas",{"$f":"'COG-M'!P1940","v":0},null,null,{"$f":"'COG-M'!P1941","v":0},{"$f":"'COG-M'!P1942","v":0},{"$f":"'COG-M'!P1943","v":0},{"$f":"'COG-M'!P1944","v":0},{"$f":"'COG-M'!P1945","v":0},{"$f":"'COG-M'!P1946","v":0},{"$f":"'COG-M'!P1947","v":0},{"$f":"SUM(C377:L377)","v":0}]
[799,"Otras erogaciones especiales",{"$f":"'COG-M'!P1948","v":0},null,null,{"$f":"'COG-M'!P1949","v":0},{"$f":"'COG-M'!P1950","v":0},{"$f":"'COG-M'!P1951","v":0},{"$f":"'COG-M'!P1952","v":0},{"$f":"'COG-M'!P1953","v":0},{"$f":"'COG-M'!P1954","v":0},{"$f":"'COG-M'!P1955","v":0},{"$f":"SUM(C378:L378)","v":0}]
[8000,"PARTICIPACIONES Y APORTACIONES",{"$f":"C380+C387+C393","v":0},{"$f":"D380+D387+D393","v":0},0,0,0,0,0,0,0,0,0]
[8100,"PARTICIPACIONES",{"$f":"SUM(C381:C386)","v":0},{"$f":"SUM(D381:D386)","v":0},0,0,0,0,0,0,0,0,0]
[811,"Fondo general de participaciones",{"$nulls":10},{"$f":"SUM(C381:L381)","v":0}]
[812,"Fondo de fomento municipal",{"$nulls":10},0]
[813,"Participaciones de las entidades federativas a los municipios",{"$nulls":10},0]
[814,"Otros conceptos participables de la Federación a entidades federativas",{"$nulls":10},0]
[815,"Otros conceptos participables de la Federación a municipios",{"$nulls":10},0]
[816,"Convenios de colaboración administrativa",{"$f":"'COG-M'!P1963","v":0},{"$f":"'COG-M'!P1964","v":0},null,{"$f":"'COG-M'!P1965","v":0},{"$f":"'COG-M'!P1966","v":0},{"$f":"'COG-M'!P1967","v":0},{"$f":"'COG-M'!P1968","v":0},{"$f":"'COG-M'!P1969","v":0},{"$f":"'COG-M'!P1970","v":0},{"$f":"'COG-M'!P1971","v":0},0]
[8300,"APORTACIONES",{"$f":"SUM(C388:C392)","v":0},{"$f":"SUM(D388:D392)","v":0},0,0,0,0,0,0,0,0,0]
[831,"Aportaciones de la Federación a las entidades federativas",{"$nulls":10},{"$f":"SUM(C388:L388)","v":0}]
[832,"Aportaciones de la Federación a municipios",{"$nulls":10},{"$f":"SUM(C389:L389)","v":0}]
[833,"Aportaciones de las entidades federativas a los municipios",{"$nulls":10},{"$f":"SUM(C390:L390)","v":0}]
[834,"Aportaciones  previstas en leyes y decretos al sistema de protección social",{"$nulls":10},{"$f":"SUM(C391:L391)","v":0}]
[835,"Aportaciones previstas en leyes y decretos compensatorias a entidades federativas y municipios",{"$nulls":10},{"$f":"SUM(C392:L392)","v":0}]
[8500,"CONVENIOS",{"$f":"SUM(C394:C396)","v":0},{"$f":"SUM(D394:D396)","v":0},0,0,0,0,0,0,0,0,0]
[851,"Convenios de reasignación",{"$f":"'COG-M'!P1979","v":0},{"$f":"'COG-M'!P1980","v":0},null,{"$f":"'COG-M'!P1981","v":0},{"$f":"'COG-M'!P1982","v":0},{"$f":"'COG-M'!P1983","v":0},{"$f":"'COG-M'!P1984","v":0},{"$f":"'COG-M'!P1985","v":0},{"$f":"'COG-M'!P1986","v":0},{"$f":"'COG-M'!P1987","v":0},{"$f":"SUM(C394:L394)","v":0}]
[852,"Convenios de descentralización",{"$f":"'COG-M'!P1988","v":0},{"$f":"'COG-M'!P1989","v":0},null,{"$f":"'COG-M'!P1990","v":0},{"$f":"'COG-M'!P1991","v":0},{"$f":"'COG-M'!P1992","v":0},{"$f":"'COG-M'!P1993","v":0},{"$f":"'COG-M'!P1994","v":0},{"$f":"'COG-M'!P1995","v":0},{"$f":"'COG-M'!P1996","v":0},{"$f":"SUM(C395:L395)","v":0}]
[853,"Otros convenios",{"$f":"'COG-M'!P1997","v":0},{"$f":"'COG-M'!P1998","v":0},null,{"$f":"'COG-M'!P1999","v":0},{"$f":"'COG-M'!P2000","v":0},{"$f":"'COG-M'!P2001","v":0},{"$f":"'COG-M'!P2002","v":0},{"$f":"'COG-M'!P2003","v":0},{"$f":"'COG-M'!P2004","v":0},{"$f":"'COG-M'!P2005","v":0},{"$f":"SUM(C396:L396)","v":0}]
[9000,"DEUDA  PÚBLICA",{"$f":"C398+C407+C416+C419+C422+C424+C427","v":0},{"$f":"D398+D407+D416+D419+D422+D424+D427","v":0},0,0,0,0,0,0,0,0,0]
[9100,"AMORTIZACIÓN DE LA DEUDA PÚBLICA ",{"$f":"SUM(C399:C406)","v":0},{"$f":"SUM(D399:D406)","v":0},0,0,0,0,0,0,0,0,0]
[911,"Amortización de la deuda interna con instituciones de crédito",{"$f":"'COG-M'!P2008","v":0},null,null,{"$f":"'COG-M'!P2009","v":0},{"$f":"'COG-M'!P2010","v":0},{"$f":"'COG-M'!P2011","v":0},{"$f":"'COG-M'!P2012","v":0},{"$f":"'COG-M'!P2013","v":0},null,null,{"$f":"SUM(C399:L399)","v":0}]
[912,"Amortización  de la deuda interna por emisión de títulos y valores",{"$f":"'COG-M'!P2014","v":0},null,null,{"$f":"'COG-M'!P2015","v":0},{"$f":"'COG-M'!P2016","v":0},{"$f":"'COG-M'!P2017","v":0},{"$f":"'COG-M'!P2018","v":0},{"$f":"'COG-M'!P2019","v":0},null,null,0]
[913,"Amortización de arrendamientos financieros nacionales",{"$f":"'COG-M'!P2020","v":0},null,null,{"$f":"'COG-M'!P2021","v":0},{"$f":"'COG-M'!P2022","v":0},{"$f":"'COG-M'!P2023","v":0},{"$f":"'COG-M'!P2024","v":0},{"$f":"'COG-M'!P2025","v":0},null,null,0]
[914,"Amortización de la deuda externa con instituciones de crédito ",{"$nulls":10},0]
[915,"Amortización de deuda externa con organismos financieros internacionales",{"$nulls":10},0]
[916,"Amortización de la deuda bilateral",{"$nulls":10},0]
[917,"Amortización de la deuda externa por emisión de títulos y valores",{"$nulls":10},0]
[918,"Amortización de arrendamientos financieros internacionales",{"$nulls":10},0]
[9200,"INTERESES DE LA DEUDA PÚBLICA",{"$f":"SUM(C408:C415)","v":0},{"$f":"SUM(D408:D415)","v":0},0,0,0,0,0,0,0,0,0]
[921,"Intereses de la deuda interna con instituciones de crédito",{"$f":"'COG-M'!P2032","v":0},null,null,{"$f":"'COG-M'!P2033","v":0},{"$f":"'COG-M'!P2034","v":0},{"$f":"'COG-M'!P2035","v":0},{"$f":"'COG-M'!P2036","v":0},{"$f":"'COG-M'!P2037","v":0},null,null,{"$f":"SUM(C408:L408)","v":0}]
[922,"Intereses derivados de la colocación de títulos y valores",{"$f":"'COG-M'!P2038","v":0},null,null,{"$f":"'COG-M'!P2039","v":0},{"$f":"'COG-M'!P2040","v":0},{"$f":"'COG-M'!P2041","v":0},{"$f":"'COG-M'!P2042","v":0},{"$f":"'COG-M'!P2043","v":0},null,null,0]
[923,"Intereses por arrendamientos  financieros nacionales",{"$f":"'COG-M'!P2044","v":0},null,null,{"$f":"'COG-M'!P2045","v":0},{"$f":"'COG-M'!P2046","v":0},{"$f":"'COG-M'!P2047","v":0},{"$f":"'COG-M'!P2048","v":0},{"$f":"'COG-M'!P2049","v":0},null,null,0]
[924,"Intereses de la deuda externa con instituciones de crédito ",{"$nulls":10},0]
[925,"Intereses de la deuda con organismos financieros internacionales",{"$nulls":10},0]
[926,"Intereses de la deuda bilateral  ",{"$nulls":10},0]
[927,"Intereses derivados de la colocación de títulos y valores en el exterior",{"$nulls":10},0]
[928,"Intereses por arrendamientos financieros internacionales",{"$nulls":10},0]
[9300,"COMISIONES DE LA DEUDA PÚBLICA",{"$f":"SUM(C417:C418)","v":0},{"$f":"SUM(D417:D418)","v":0},0,0,0,0,0,0,0,0,0]
[931,"Comisiones de la deuda pública interna",{"$f":"'COG-M'!P2056","v":0},null,null,{"$f":"'COG-M'!P2057","v":0},{"$f":"'COG-M'!P2058","v":0},{"$f":"'COG-M'!P2059","v":0},{"$f":"'COG-M'!P2060","v":0},{"$f":"'COG-M'!P2061","v":0},null,null,{"$f":"SUM(C417:L417)","v":0}]
[932,"Comisiones de la deuda pública externa",{"$nulls":10},{"$f":"SUM(C418:L418)","v":0}]
[9400,"GASTOS DE LA DEUDA PÚBLICA",{"$f":"SUM(C420:C421)","v":0},{"$f":"SUM(D420:D421)","v":0},0,0,0,0,0,0,0,0,{"$f":"SUM(M420:M421)","v":0}]
[941,"Gastos de la deuda pública interna",{"$f":"'COG-M'!P2064","v":0},null,null,{"$f":"'COG-M'!P2065","v":0},{"$f":"'COG-M'!P2066","v":0},{"$f":"'COG-M'!P2067","v":0},{"$f":"'COG-M'!P2068","v":0},{"$f":"'COG-M'!P2069","v":0},null,null,{"$f":"SUM(C420:L420)","v":0}]
[942,"Gastos de la deuda  pública externa",{"$nulls":10},{"$f":"SUM(C421:L421)","v":0}]
[9500,"COSTO POR COBERTURAS",{"$f":"SUM(C423)","v":0},{"$f":"SUM(D423)","v":0},0,0,0,0,0,0,0,0,0]
[951,"Costos por coberturas",{"$f":"'COG-M'!P2072","v":0},null,null,{"$f":"'COG-M'!P2073","v":0},{"$f":"'COG-M'!P2074","v":0},{"$f":"'COG-M'!P2075","v":0},{"$f":"'COG-M'!P2076","v":0},{"$f":"'COG-M'!P2077","v":0},null,null,{"$f":"SUM(C423:L423)","v":0}]
[9600,"APOYOS FINANCIEROS",{"$f":"SUM(C425:C426)","v":0},{"$f":"SUM(D425:D426)","v":0},0,0,0,0,0,0,0,0,0]
[961,"Apoyos a intermediarios financieros",{"$nulls":10},{"$f":"SUM(C425:L425)","v":0}]
[962,"Apoyos a ahorradores y deudores del Sistema Financiero Nacional",{"$nulls":10},{"$f":"SUM(C426:L426)","v":0}]
[9900,"ADEUDOS DE EJERCICIOS FISCALES ANTERIORES (ADEFAS)",{"$f":"SUM(C428)","v":0},{"$f":"SUM(D428)","v":0},0,0,0,0,0,0,0,0,0]
[991,"ADEFAS",{"$f":"'COG-M'!P2082","v":0},null,null,{"$f":"'COG-M'!P2083","v":0},{"$f":"'COG-M'!P2084","v":0},{"$f":"'COG-M'!P2085","v":0},{"$f":"'COG-M'!P2086","v":0},{"$f":"'COG-M'!P2087","v":0},null,null,{"$f":"SUM(C428:L428)","v":0}]
[null,"TOTAL DE EGRESOS",{"$f":"C3+C40+C105+C190+C250+C309+C331+C379+C397","v":{"v":2205131,"d":"2,205,131"}},0,0,0,0,0,0,0,{"$f":"K3+K40+K105+K190+K250+K309+K331+K379+K397","v":0},{"$f":"L3+L40+L105+L190+L250+L309+L331+L379+L397","v":0},{"$f":"M3+M40+M105+M190+M250+M309+M331+M379+M397","v":{"v":2205131,"d":"2,205,131"}}]

{"sheet":"CTG-FF","index":9,"n_rows":19,"n_cols":13,"rows_kept":19,"merged":[[0,0,1,0],[0,1,1,1],[0,2,0,8],[0,9,0,11],[0,12,1,12]]}
["CTG","DESCRIPCIÓN","1.  NO ETIQUETADO",{"$nulls":6},"2.  ETIQUETADO",null,null,"TOTAL ANUAL"]
[null,null,"1.1\nRECURSOS FISCALES","1.2\nFINANCIAMIENTOS INTERNOS","1.3\nFINANCIAMIENTOS EXTERNOS","1.4\nINGRESOS \nPROPIOS","1.5\nRECURSOS\nFEDERALES","1.6\nRECURSOS ESTATALES","1.7\nOTROS RECURSOS DE LIBRE DISPOSICIÓN","2.5 \nRECURSOS FEDERALES","2.6\nRECURSOS ESTATALES","2.7\nOTROS RECURSOS DE TRANSFERENCIAS FEDERALES ETIQUETADAS"]
[1,"Gasto corriente",{"$f":"SUM('COG-FF'!C3+'COG-FF'!C40+'COG-FF'!C105+'COG-FF'!C190-'COG-FF'!C226)","v":{"v":2185715,"d":"2,185,715"}},{"$f":"SUM('COG-FF'!D3+'COG-FF'!D40+'COG-FF'!D105+'COG-FF'!D190-'COG-FF'!D226)","v":0},{"$f":"SUM('COG-FF'!E3+'COG-FF'!E40+'COG-FF'!E105+'COG-FF'!E190-'COG-FF'!E226)","v":0},{"$f":"SUM('COG-FF'!F3+'COG-FF'!F40+'COG-FF'!F105+'COG-FF'!F190-'COG-FF'!F226)","v":0},{"$f":"SUM('COG-FF'!G3+'COG-FF'!G40+'COG-FF'!G105+'COG-FF'!G190-'COG-FF'!G226)","v":0},{"$f":"SUM('COG-FF'!H3+'COG-FF'!H40+'COG-FF'!H105+'COG-FF'!H190-'COG-FF'!H226)","v":0},{"$f":"SUM('COG-FF'!I3+'COG-FF'!I40+'COG-FF'!I105+'COG-FF'!I190-'COG-FF'!I226)","v":0},{"$f":"SUM('COG-FF'!J3+'COG-FF'!J40+'COG-FF'!J105+'COG-FF'!J190-'COG-FF'!J226)","v":0},{"$f":"SUM('COG-FF'!K3+'COG-FF'!K40+'COG-FF'!K105+'COG-FF'!K190-'COG-FF'!K226)","v":0},{"$f":"SUM('COG-FF'!L3+'COG-FF'!L40+'COG-FF'!L105+'COG-FF'!L190-'COG-FF'!L226)","v":0},{"$f":"SUM(C3:L3)","v":{"v":2185715,"d":"2,185,715"}}]
[2,"Gasto de capital",{"$f":"SUM('COG-FF'!C250+'COG-FF'!C309+'COG-FF'!C331)","v":{"v":19416,"d":"19,416"}},{"$f":"SUM('COG-FF'!D250+'COG-FF'!D309+'COG-FF'!D331)","v":0},{"$f":"SUM('COG-FF'!E250+'COG-FF'!E309+'COG-FF'!E331)","v":0},{"$f":"SUM('COG-FF'!F250+'COG-FF'!F309+'COG-FF'!F331)","v":0},{"$f":"SUM('COG-FF'!G250+'COG-FF'!G309+'COG-FF'!G331)","v":0},{"$f":"SUM('COG-FF'!H250+'COG-FF'!H309+'COG-FF'!H331)","v":0},{"$f":"SUM('COG-FF'!I250+'COG-FF'!I309+'COG-FF'!I331)","v":0},{"$f":"SUM('COG-FF'!J250+'COG-FF'!J309+'COG-FF'!J331)","v":0},{"$f":"SUM('COG-FF'!K250+'COG-FF'!K309+'COG-FF'!K331)","v":0},{"$f":"SUM('COG-FF'!L250+'COG-FF'!L309+'COG-FF'!L331)","v":0},{"$f":"SUM(C4:L4)","v":{"v":19416,"d":"19,416"}}]
[3,"Amortización de la deuda y disminución de pasivos",{"$f":"SUM('COG-FF'!C397)","v":0},{"$f":"SUM('COG-FF'!D397)","v":0},{"$f":"SUM('COG-FF'!E397)","v":0},{"$f":"SUM('COG-FF'!F397)","v":0},{"$f":"SUM('COG-FF'!G397)","v":0},{"$f":"SUM('COG-FF'!H397)","v":0},{"$f":"SUM('COG-FF'!I397)","v":0},{"$f":"SUM('COG-FF'!J397)","v":0},{"$f":"SUM('COG-FF'!K397)","v":0},{"$f":"SUM('COG-FF'!L397)","v":0},{"$f":"SUM(C5:L5)","v":0}]
[4,"Pensiones y jubilaciones",{"$f":"SUM('COG-FF'!C226)","v":0},{"$f":"SUM('COG-FF'!D226)","v":0},{"$f":"SUM('COG-FF'!E226)","v":0},{"$f":"SUM('COG-FF'!F226)","v":0},{"$f":"SUM('COG-FF'!G226)","v":0},{"$f":"SUM('COG-FF'!H226)","v":0},{"$f":"SUM('COG-FF'!I226)","v":0},{"$f":"SUM('COG-FF'!J226)","v":0},{"$f":"SUM('COG-FF'!K226)","v":0},{"$f":"SUM('COG-FF'!L226)","v":0},{"$f":"SUM(C6:L6)","v":0}]
[5,"Participaciones",{"$f":"SUM('COG-FF'!C379)","v":0},{"$f":"SUM('COG-FF'!D379)","v":0},{"$f":"SUM('COG-FF'!E379)","v":0},{"$f":"SUM('COG-FF'!F379)","v":0},{"$f":"SUM('COG-FF'!G379)","v":0},{"$f":"SUM('COG-FF'!H379)","v":0},{"$f":"SUM('COG-FF'!I379)","v":0},{"$f":"SUM('COG-FF'!J379)","v":0},{"$f":"SUM('COG-FF'!K379)","v":0},{"$f":"SUM('COG-FF'!L379)","v":0},{"$f":"SUM(C7:L7)","v":0}]
[null,"TOTAL DE EGRESOS",{"$f":"SUM(C3:C7)","v":{"v":2205131,"d":"2,205,131"}},{"$f":"SUM(D3:D7)","v":0},0,0,0,0,0,0,0,0,{"v":2205131,"d":"2,205,131"}]
[]
[]
[]
[]
["COG","DESCRIPCIÓN","CAPÍTULO 1000","CAPÍTULO 2000","CAPÍTULO 3000","CAPÍTULO 4000","CAPÍTULO 5000","CAPÍTULO 6000","CAPÍTULO 7000","CAPÍTULO 8000","CAPÍTULO 9000","TOTAL ANUAL"]
[1,"Gasto corriente",{"$f":"'COG-FF'!M3","v":{"v":1490399,"d":"1,490,399"}},{"$f":"'COG-FF'!M40","v":{"v":370128,"d":"370,128"}},{"$f":"'COG-FF'!M105","v":{"v":255372,"d":"255,372"}},{"$f":"SUM('COG-FF'!M190-'COG-FF'!M226)","v":{"v":69816,"d":"69,816"}},{"$nulls":5},{"$f":"SUM(C14:K14)","v":{"v":2185715,"d":"2,185,715"}}]
[2,"Gasto de capital",{"$nulls":4},{"$f":"'COG-FF'!M250","v":{"v":19416,"d":"19,416"}},{"$f":"'COG-FF'!M309","v":0},{"$f":"'COG-FF'!M331","v":0},null,null,{"$f":"SUM(C15:K15)","v":{"v":19416,"d":"19,416"}}]
[3,"Amortización de la deuda y disminución de pasivos",{"$nulls":8},{"$f":"'COG-FF'!M397","v":0},{"$f":"SUM(C16:K16)","v":0}]
[4,"Pensiones y jubilaciones",{"$nulls":3},{"$f":"'COG-FF'!M226","v":0},{"$nulls":5},{"$f":"SUM(C17:K17)","v":0}]
[5,"Participaciones",{"$nulls":7},{"$f":"'COG-FF'!M379","v":0},null,{"$f":"SUM(C18:K18)","v":0}]
[null,"TOTAL DE EGRESOS",{"$f":"C14","v":{"v":1490399,"d":"1,490,399"}},{"$f":"D14","v":{"v":370128,"d":"370,128"}},{"$f":"E14","v":{"v":255372,"d":"255,372"}},{"$f":"SUM(F14+F17)","v":{"v":69816,"d":"69,816"}},{"$f":"G15","v":{"v":19416,"d":"19,416"}},{"$f":"H15","v":0},{"$f":"I15","v":0},{"$f":"J18","v":0},{"$f":"K16","v":0},{"$f":"SUM(L14:L18)","v":{"v":2205131,"d":"2,205,131"}}]

{"sheet":"CF","index":10,"n_rows":146,"n_cols":3,"rows_kept":146,"merged":[[0,0,1,0],[0,1,1,1],[0,2,1,2]]}
["CF","DESCRIPCIÓN","TOTAL ANUAL"]
[]
[1,"GOBIERNO",{"$f":"C4+C7+C12+C22+C24+C27+C31+C36","v":{"v":2205131,"d":"2,205,131"}}]
[11,"LEGISLACIÓN",{"$f":"SUM(C5:C6)","v":0}]
[111,"Legislación",0]
[112,"Fiscalización",0]
[12,"JUSTICIA",{"$f":"SUM(C8:C11)","v":0}]
[121,"Impartición de justicia",0]
[122,"Procuración de justicia",0]
[123,"Reclusión y readaptación social",0]
[124,"Derechos humanos",0]
[13,"COORDINACIÓN DE LA POLÍTICA DE GOBIERNO",{"$f":"SUM(C13:C21)","v":{"v":2205131,"d":"2,205,131"}}]
[131,"Presidencia/Gubernatura"]
[132,"Política interior"]
[133,"Preservación y cuidado del patrimonio público"]
[134,"Función pública"]
[135,"Asuntos jurídicos"]
[136,"Organización de procesos electorales",0]
[137,"Población",{"v":2205131,"d":"2,205,131"}]
[138,"Territorio"]
[139,"Otros"]
[14,"RELACIONES EXTERIORES",{"$f":"SUM(C23:C23)","v":0}]
[141,"Relaciones exteriores"]
[15,"ASUNTOS FINANCIEROS Y HACENDARIOS",{"$f":"SUM(C25:C26)","v":0}]
[151,"Asuntos financieros  "]
[152,"Asuntos hacendarios"]
[16,"SEGURIDAD NACIONAL",{"$f":"SUM(C28:C30)","v":0}]
[161,"Defensa",0]
[162,"Marina",0]
[163,"Inteligencia para la preservación de la seguridad nacional",0]
[17,"ASUNTOS DE ORDEN PÚBLICO Y DE SEGURIDAD INTERIOR",{"$f":"SUM(C32:C35)","v":0}]
[171,"Policía"]
[172,"Protección civil"]
[173,"Otros asuntos de orden público y seguridad"]
[174,"Sistema nacional de seguridad pública",0]
[18,"OTROS SERVICIOS GENERALES",{"$f":"SUM(C37:C41)","v":0}]
[181,"Servicios registrales, administrativos y patrimoniales"]
[182,"Servicios estadísticos"]
[183,"Servicios de comunicación y medios"]
[184,"Acceso a la información pública gubernamental"]
[185,"Otros"]
[2,"DESARROLLO SOCIAL",{"$f":"C43+C50+C58+C64+C69+C76+C86","v":0}]
[21,"PROTECCIÓN AMBIENTAL",{"$f":"SUM(C44:C49)","v":0}]
[211,"Ordenación de desechos"]
[212,"Administración del agua",0]
[213,"Ordenación de aguas residuales, drenaje y alcantarillado"]
[214,"Reducción de la contaminación"]
[215,"Protección de la diversidad biológica y del paisaje"]
[216,"Otros de protección ambiental"]
[22,"VIVIENDA Y SERVICIOS A LA COMUNIDAD",{"$f":"SUM(C51:C57)","v":0}]
[221,"Urbanización"]
[222,"Desarrollo comunitario"]
[223,"Abastecimiento de agua"]
[224,"Alumbrado público"]
[225,"Vivienda",0]
[226,"Servicios comunales"]
[227,"Desarrollo regional",0]
[23,"SALUD",{"$f":"SUM(C59:C63)","v":0}]
[231,"Prestación de servicios de salud a la comunidad"]
[232,"Prestación de servicios de salud a la persona",0]
[233,"Generación de recursos para la salud",0]
[234,"Rectoría del sistema de salud",0]
[235,"Protección social en salud",0]
[24,"RECREACIÓN, CULTURA Y OTRAS MANIFESTACIONES SOCIALES",{"$f":"SUM(C65:C68)","v":0}]
[241,"Deporte y recreación"]
[242,"Cultura"]
[243,"Radio, televisión y editoriales",0]
[244,"Asuntos religiosos y otras manifestaciones sociales"]
[25,"EDUCACIÓN",{"$f":"SUM(C70:C75)","v":0}]
[251,"Educación básica"]
[252,"Educación media superior",0]
[253,"Educación superior",0]
[254,"Posgrado",0]
[255,"Educación para adultos",0]
[256,"Otros servicios educativos y actividades inherentes"]
[26,"PROTECCIÓN SOCIAL  ",{"$f":"SUM(C77:C85)","v":0}]
[261,"Enfermedades e incapacidad"]
[262,"Edad avanzada"]
[263,"Familia e hijos"]
[264,"Desempleo",0]
[265,"Alimentación y nutrición"]
[266,"Apoyo social para la vivienda"]
[267,"Indígenas"]
[268,"Otros grupos vulnerables"]
[269,"Otros de seguridad social y asistencia social"]
[27,"OTROS ASUNTOS SOCIALES",{"$f":"SUM(C87:C87)","v":0}]
[271,"Otros asuntos sociales"]
[3,"DESARROLLO ECONÓMICO",{"$f":"C89+C92+C99+C106+C110+C117+C119+C122+C127","v":0}]
[31,"ASUNTOS ECONÓMICOS, COMERCIALES Y LABORALES EN GENERAL",{"$f":"SUM(C90:C91)","v":0}]
[311,"Asuntos económicos y comerciales en general"]
[312,"Asuntos laborales generales"]
[32,"AGROPECUARÍA, SILVICULTURA, PESCA Y CAZA",{"$f":"SUM(C93:C98)","v":0}]
[321,"Agropecuaria"]
[322,"Silvicultura"]
[323,"Acuacultura, pesca y caza"]
[324,"Agroindustrial"]
[325,"Hidroagrícola"]
[326,"Apoyo financiero a la banca y seguro agropecuario",0]
[33,"COMBUSTIBLE Y ENERGÍA",{"$f":"SUM(C100:C105)","v":0}]
[331,"Carbón y otros combustibles minerales sólidos",0]
[332,"Petróleo y gas natural (hidrocarburos)",0]
[333,"Combustibles Nucleares",0]
[334,"Otros combustibles",0]
[335,"Electricidad"]
[336,"Energía no Eléctrica"]
[34,"MINERÍA, MANUFACTURAS Y CONSTRUCCIÓN",{"$f":"SUM(C107:C109)","v":0}]
[341,"Extracción de recursos minerales excepto los combustibles minerales",0]
[342,"Manufacturas",0]
[343,"Construcción",0]
[35,"TRANSPORTE",{"$f":"SUM(C111:C116)","v":0}]
[351,"Transporte por carretera"]
[352,"Transporte por agua y puertos"]
[353,"Transporte por ferrocarril",0]
[354,"Transporte aéreo",0]
[355,"Transporte por oleoductos y gasoductos y otros sistemas de transporte",0]
[356,"Otros relacionados con transporte"]
[36,"COMUNICACIONES",{"$f":"SUM(C118:C118)","v":0}]
[361,"Comunicaciones"]
[37,"TURISMO",{"$f":"SUM(C120:C121)","v":0}]
[371,"Turismo"]
[372,"Hoteles y restaurantes",0]
[38,"CIENCIA, TECNOLOGÍA E INNOVACIÓN",{"$f":"SUM(C123:C126)","v":0}]
[381,"Investigación científica",0]
[382,"Desarrollo tecnológico",0]
[383,"Servicios científicos y tecnológicos",0]
[384,"Innovación",0]
[39,"OTRAS INDUSTRIAS Y OTROS ASUNTOS ECONÓMICOS",{"$f":"SUM(C128:C130)","v":0}]
[391,"Comercio, distribución, almacenamiento y depósito"]
[392,"Otras industrias  "]
[393,"Otros asuntos económicos"]
[4,"OTRAS NO CLASIFICADAS EN FUNCIONES ANTERIORES",{"$f":"C132+C135+C139+C144","v":0}]
[41,"TRANSACCIONES DE LA DEUDA PÚBLICA/COSTO FINANCIERO DE LA DEUDA",{"$f":"SUM(C133:C134)","v":0}]
[411,"Deuda pública interna"]
[412,"Deuda pública externa",0]
[42,"TRANSFERENCIAS, PARTICIPACIONES Y APORTACIONES ENTRE DIFERENTES NIVELES Y ORDENES DE GOBIERNO",{"$f":"SUM(C136:C138)","v":0}]
[421,"Transferencia entre diferentes niveles y ordenes de gobierno"]
[422,"Participaciones entre diferentes niveles y ordenes de gobierno",0]
[423,"Aportaciones entre diferentes niveles y ordenes de gobierno",0]
[43,"SANEAMIENTO DEL SISTEMA FINANCIERO",{"$f":"SUM(C140:C143)","v":0}]
[431,"Saneamiento del sistema financiero",0]
[432,"Apoyos IPAB",0]
[433,"Banca de desarrollo",0]
[434,"Apoyo a los programas de reestructura en unidades de inversión (UDIS)",0]
[44,"ADEUDOS DE EJERCICIOS FISCALES ANTERIORES  ",{"$f":"SUM(C145:C145)","v":0}]
[441,"adeudos de ejercicios fiscales anteriores"]
[null,"TOTAL DE EGRESOS",{"$f":"C3+C42+C88+C131","v":{"v":2205131,"d":"2,205,131"}}]

{"sheet":"CA","index":11,"n_rows":76,"n_cols":4,"rows_kept":76,"merged":[[0,0,1,0],[0,1,1,1],[0,2,1,2],[0,3,1,3],[2,2,2,3],[3,2,3,3],[4,2,4,3]]}
["CA","UA","NOMBRE DE LA UNIDAD RESPONSABLE","TOTAL ANUAL"]
[]
["3.0.0.0.0.",null,"SECTOR PÚBLICO MUNICIPAL"]
["3.1.1.0.0.",null,"GOBIERNO GENERAL MUNICIPAL"]
["3.1.1.1.0.",null,"Gobierno Municipal"]
[{"$nulls":3},{"v":2205131,"d":"2,205,131.00"}]
{"$rows_empty":69}
[null,null,"SUMA",{"$f":"SUM(D6:D75)","v":{"v":2205131,"d":"2,205,131.00"}}]

{"sheet":"EA","index":12,"n_rows":53,"n_cols":6,"rows_kept":53}
[null,"Pensiones y jubilaciones","Salud","Riesgos de trabajo","Invalidez y vida","Obras prestaciones sociales"]
["Tipo de sistema"]
["Prestación laboral o fondo general para trabajadores del  municipio"]
["Beneficio definido, contribución definida o mixto"]
["Población afiliada"]
["Activos ",13]
["Edad máxima"]
["Edad mínima"]
["Edad promedio"]
["Pensionados y jubilados"]
["Edad máxima"]
["Edad mínima"]
["Edad promedio"]
["Beneficiarios"]
["Promedio de años de servicio (trabajadores activos)"]
["Aportación individual al plan de pensión como % del salario"]
["Aportación del ente público al plan de pensión como % del salario"]
["Crecimiento esperado de los pensionados y jubilados (como %)"]
["Crecimiento esperado de los activos (como %)"]
["Edad de jubilación o pensión"]
["Esperanza de vida"]
["Ingresos del fondo"]
["Ingresos anuales al fondo de pensiones"]
["Nómina anual"]
["Activos"]
["Pensiones y jubilados"]
["Beneficiarios de pensionados y jubilados"]
["Monto mensual por pensión "]
["Máximo"]
["Mínimo"]
["Promedio"]
["Monto de la reserva"]
["Valor presente de las obligaciones"]
["Pensiones y jubilaciones en curso de pago"]
["Generación actual"]
["Generaciones futuras"]
["Valor presente de las contribuciones asociadas a los sueldos futuros de cotización X%"]
["Generación actual"]
["Generaciones futuras"]
["Otros ingresos"]
["Déficit/superávit actuarial"]
["Generación actual"]
["Generaciones futuras"]
["Periodo de suficiencia"]
["Año de descapitalización"]
["Tasa de rendimiento"]
["Estudio actuarial"]
["Año de elaboración del estudio actuarial"]
["Empresa que elaboró el estudio actuarial"]
[]
[]
[]
[null,{"$f":"COUNTA(B6:F21,B3:F4,B23:F23,B25:F27,B29:F32,B34:F36,B38:F40,B42:F43,B45:F46,B48:F49)","v":1}]

{"sheet":"Plantilla","index":13,"n_rows":429,"n_cols":15,"rows_kept":429,"merged":[[0,0,1,1],[0,2,1,2],[0,3,1,3],[0,4,1,4],[0,5,1,5],[0,6,0,7],[0,14,1,14],[2,0,2,1],[3,0,3,1],[4,0,4,1],[5,0,5,1],[6,0,6,1],[7,0,7,1],[8,0,8,1],[9,0,9,1],[10,0,10,1],[11,0,11,1],[12,0,12,1],[13,0,13,1],[14,0,14,1],[15,0,15,1],[16,0,16,1],[17,0,17,1],[18,0,18,1],[19,0,19,1],[20,0,20,1],[21,0,21,1],[22,0,22,1],[23,0,23,1],[24,0,24,1],[25,0,25,1],[26,0,26,1],[27,0,27,1],[28,0,28,1],[29,0,29,1],[30,0,30,1],[31,0,31,1],[32,0,32,1],[33,0,33,1],[34,0,34,1],[35,0,35,1],[36,0,36,1],[37,0,37,1],[38,0,38,1],[39,0,39,1],[40,0,40,1],[41,0,41,1],[42,0,42,1],[43,0,43,1],[44,0,44,1],[45,0,45,1],[46,0,46,1],[47,0,47,1],[48,0,48,1],[49,0,49,1],[50,0,50,1],[51,0,51,1],[52,0,52,1],[53,0,53,1],[54,0,54,1],[55,0,55,1],[56,0,56,1],[57,0,57,1],[58,0,58,1],[59,0,59,1],[60,0,60,1],[61,0,61,1],[62,0,62,1],[63,0,63,1],[64,0,64,1],[65,0,65,1],[66,0,66,1],[67,0,67,1],[68,0,68,1],[69,0,69,1],[70,0,70,1],[71,0,71,1],[72,0,72,1],[73,0,73,1],[74,0,74,1],[75,0,75,1],[76,0,76,1],[77,0,77,1],[78,0,78,1],[79,0,79,1],[80,0,80,1],[81,0,81,1],[82,0,82,1],[83,0,83,1],[84,0,84,1],[85,0,85,1],[86,0,86,1],[87,0,87,1],[88,0,88,1],[89,0,89,1],[90,0,90,1],[91,0,91,1],[92,0,92,1],[93,0,93,1],[94,0,94,1],[95,0,95,1],[96,0,96,1],[97,0,97,1],[98,0,98,1],[99,0,99,1],[100,0,100,1],[101,0,101,1],[102,0,102,1],[103,0,103,1],[104,0,104,1],[105,0,105,1],[106,0,106,1],[107,0,107,1],[108,0,108,1],[109,0,109,1],[110,0,110,1],[111,0,111,1],[112,0,112,1],[113,0,113,1],[114,0,114,1],[115,0,115,1],[116,0,116,1],[117,0,117,1],[118,0,118,1],[119,0,119,1],[120,0,120,1],[121,0,121,1],[122,0,122,1],[123,0,123,1],[124,0,124,1],[125,0,125,1],[126,0,126,1],[127,0,127,1],[128,0,128,1],[129,0,129,1],[130,0,130,1],[131,0,131,1],[132,0,132,1],[133,0,133,1],[134,0,134,1],[135,0,135,1],[136,0,136,1],[137,0,137,1],[138,0,138,1],[139,0,139,1],[140,0,140,1],[141,0,141,1],[142,0,142,1],[143,0,143,1],[144,0,144,1],[145,0,145,1],[146,0,146,1],[147,0,147,1],[148,0,148,1],[149,0,149,1],[150,0,150,1],[151,0,151,1],[152,0,152,1],[153,0,153,1],[154,0,154,1],[155,0,155,1],[156,0,156,1],[157,0,157,1],[158,0,158,1],[159,0,159,1],[160,0,160,1],[161,0,161,1],[162,0,162,1],[163,0,163,1],[164,0,164,1],[165,0,165,1],[166,0,166,1],[167,0,167,1],[168,0,168,1],[169,0,169,1],[170,0,170,1],[171,0,171,1],[172,0,172,1],[173,0,173,1],[174,0,174,1],[175,0,175,1],[176,0,176,1],[177,0,177,1],[178,0,178,1],[179,0,179,1],[180,0,180,1],[181,0,181,1],[182,0,182,1],[183,0,183,1],[184,0,184,1],[185,0,185,1],[186,0,186,1],[187,0,187,1],[188,0,188,1],[189,0,189,1],[190,0,190,1],[191,0,191,1],[192,0,192,1],[193,0,193,1],[194,0,194,1],[195,0,195,1],[196,0,196,1],[197,0,197,1],[198,0,198,1],[199,0,199,1],[200,0,200,1],[201,0,201,1],[202,0,202,1],[203,0,203,1],[204,0,204,1],[205,0,205,1],[206,0,206,1],[207,0,207,1],[208,0,208,1],[209,0,209,1],[210,0,210,1],[211,0,211,1],[212,0,212,1],[213,0,213,1],[214,0,214,1],[215,0,215,1],[216,0,216,1],[217,0,217,1],[218,0,218,1],[219,0,219,1],[220,0,220,1],[221,0,221,1],[222,0,222,1],[223,0,223,1],[224,0,224,1],[225,0,225,1],[226,0,226,1],[227,0,227,1],[228,0,228,1],[229,0,229,1],[230,0,230,1],[231,0,231,1],[232,0,232,1],[233,0,233,1],[234,0,234,1],[235,0,235,1],[236,0,236,1],[237,0,237,1],[238,0,238,1],[239,0,239,1],[240,0,240,1],[241,0,241,1],[242,0,242,1],[243,0,243,1],[244,0,244,1],[245,0,245,1],[246,0,246,1],[247,0,247,1],[248,0,248,1],[249,0,249,1],[250,0,250,1],[251,0,251,1],[252,0,252,1],[253,0,253,1],[254,0,254,1],[255,0,255,1],[256,0,256,1],[257,0,257,1],[258,0,258,1],[259,0,259,1],[260,0,260,1],[261,0,261,1],[262,0,262,1],[263,0,263,1],[264,0,264,1],[265,0,265,1],[266,0,266,1],[267,0,267,1],[268,0,268,1],[269,0,269,1],[270,0,270,1],[271,0,271,1],[272,0,272,1],[273,0,273,1],[274,0,274,1],[275,0,275,1],[276,0,276,1],[277,0,277,1],[278,0,278,1],[279,0,279,1],[280,0,280,1],[281,0,281,1],[282,0,282,1],[283,0,283,1],[284,0,284,1],[285,0,285,1],[286,0,286,1],[287,0,287,1],[288,0,288,1],[289,0,289,1],[290,0,290,1],[291,0,291,1],[292,0,292,1],[293,0,293,1],[294,0,294,1],[295,0,295,1],[296,0,296,1],[297,0,297,1],[298,0,298,1],[299,0,299,1],[300,0,300,1],[301,0,301,1],[302,0,302,1],[303,0,303,1],[304,0,304,1],[305,0,305,1],[306,0,306,1],[307,0,307,1],[308,0,308,1],[309,0,309,1],[310,0,310,1],[311,0,311,1],[312,0,312,1],[313,0,313,1],[314,0,314,1],[315,0,315,1],[316,0,316,1],[317,0,317,1],[318,0,318,1],[319,0,319,1],[320,0,320,1],[321,0,321,1],[322,0,322,1],[323,0,323,1],[324,0,324,1],[325,0,325,1],[326,0,326,1],[327,0,327,1],[328,0,328,1],[329,0,329,1],[330,0,330,1],[331,0,331,1],[332,0,332,1],[333,0,333,1],[334,0,334,1],[335,0,335,1],[336,0,336,1],[337,0,337,1],[338,0,338,1],[339,0,339,1],[340,0,340,1],[341,0,341,1],[342,0,342,1],[343,0,343,1],[344,0,344,1],[345,0,345,1],[346,0,346,1],[347,0,347,1],[348,0,348,1],[349,0,349,1],[350,0,350,1],[351,0,351,1],[352,0,352,1],[353,0,353,1],[354,0,354,1],[355,0,355,1],[356,0,356,1],[357,0,357,1],[358,0,358,1],[359,0,359,1],[360,0,360,1],[361,0,361,1],[362,0,362,1],[363,0,363,1],[364,0,364,1],[365,0,365,1],[366,0,366,1],[367,0,367,1],[368,0,368,1],[369,0,369,1],[370,0,370,1],[371,0,371,1],[372,0,372,1],[373,0,373,1],[374,0,374,1],[375,0,375,1],[376,0,376,1],[377,0,377,1],[378,0,378,1],[379,0,379,1],[380,0,380,1],[381,0,381,1],[382,0,382,1],[383,0,383,1],[384,0,384,1],[385,0,385,1],[386,0,386,1],[387,0,387,1],[388,0,388,1],[389,0,389,1],[390,0,390,1],[391,0,391,1],[392,0,392,1],[393,0,393,1],[394,0,394,1],[395,0,395,1],[396,0,396,1],[397,0,397,1],[398,0,398,1],[399,0,399,1],[400,0,400,1],[401,0,401,1],[402,0,402,1],[403,0,403,1],[404,0,404,1],[405,0,405,1],[406,0,406,1],[407,0,407,1],[408,0,408,1],[409,0,409,1],[410,0,410,1],[411,0,411,1],[412,0,412,1],[413,0,413,1],[414,0,414,1],[415,0,415,1],[416,0,416,1],[417,0,417,1],[418,0,418,1],[419,0,419,1],[420,0,420,1],[421,0,421,1],[422,0,422,1],[423,0,423,1],[424,0,424,1],[425,0,425,1],[426,0,426,1],[427,0,427,1],[428,1,428,4]]}
["NOMBRE DE LA PLAZA",null,"ADSCRIPCIÓN DE LA PLAZA","PARTIDA GENERICA","FF ","No. PLAZAS","111-113\nDIETAS Y SUELDO BASE",null,131,132,132,133,134,1500,"SUMA TOTAL DE REMUNERACIONES"]
[{"$nulls":6},"MENSUAL","ANUAL","PRIMAS POR AÑOS DE SERVICIOS EFECTIVOS PRESTADOS","PRIMA VACACIONAL Y DOMINICAL","GRATIFICACIÓN DE FIN DE AÑO (AGUINALDO)","HORAS EXTRAORDINARIAS","COMPENSACIONES","OTRAS PRESTACIONES"]
["DIRECTOR",null,"SISTEMA DIF MSICG",{"$nulls":4},{"$f":"IF(E3=\"\",\"SE REQUIERE ASIGNAR LA FUENTE DE FINANCIAMIENTO\",IF(F3=\"\",\"ES NECESARIO ESTABLECER EL NÚMERO DE PLAZAS\",IF(G3=\"\",\"SE NECESITA ESTABLECER UN MONTO MENSUAL\",F3*G3*12)))","v":"SE REQUIERE ASIGNAR LA FUENTE DE FINANCIAMIENTO"},{"$nulls":6},{"$f":"SUM(H3:N3)","v":0}]
["ASISTENCIA ALIMENTARIA",null,"SISTEMA DIF MSICG",{"$nulls":4},{"$f":"IF(E4=\"\",\"SE REQUIERE ASIGNAR LA FUENTE DE FINANCIAMIENTO\",IF(F4=\"\",\"ES NECESARIO ESTABLECER EL NÚMERO DE PLAZAS\",IF(G4=\"\",\"SE NECESITA ESTABLECER UN MONTO MENSUAL\",F4*G4*12)))","v":"SE REQUIERE ASIGNAR LA FUENTE DE FINANCIAMIENTO"},{"$nulls":6},{"$f":"SUM(H4:N4)","v":0}]
["COCINERA",null,"SISTEMA DIF MSICG",113,11,1,{"v":4213,"d":"4,213"},{"v":50556,"d":"50,556"},null,693,{"v":6930,"d":"6,930"},{"$nulls":3},{"v":58179,"d":"58,179"}]
["AUXILIAR ADMINISTRATIVO",null,"SISTEMA DIF MSICG",113,11,1,{"v":7256,"d":"7,256"},{"v":87072,"d":"87,072"},null,{"v":1194,"d":"1,194"},{"v":11934,"d":"11,934"},{"$nulls":3},{"v":100200,"d":"100,200"}]
["PSICOLOGA",null,"SISTEMA DIF MSICG",113,11,1,{"v":10101,"d":"10,101"},{"v":121212,"d":"121,212"},null,{"v":1661,"d":"1,661"},{"v":16614,"d":"16,614"},{"$nulls":3},{"v":139487,"d":"139,487"}]
["AUXILIAR OPERATIVO MANTENIMIENTO",null,"SISTEMA DIF MSICG",113,11,1,{"v":5666,"d":"5,666"},{"v":67992,"d":"67,992"},null,932,{"v":9319,"d":"9,319"},{"$nulls":3},{"v":78243,"d":"78,243"}]
["AUXILIAR ADMINISTRATIVO",null,"SISTEMA DIF MSICG",113,11,1,{"v":5313,"d":"5,313"},{"v":63756,"d":"63,756"},null,874,{"v":8738,"d":"8,738"},{"$nulls":3},{"v":73368,"d":"73,368"}]
["ENCARGADO UBR",null,"SISTEMA DIF MSICG",113,11,1,{"v":6490,"d":"6,490"},{"v":77880,"d":"77,880"},null,{"v":1068,"d":"1,068"},{"v":10675,"d":"10,675"},{"$nulls":3},{"v":89623,"d":"89,623"}]
["INTENDENCIA",null,"SISTEMA DIF MSICG",113,11,1,{"v":4214,"d":"4,214"},{"v":50568,"d":"50,568"},null,693,{"v":6930,"d":"6,930"},{"$nulls":3},{"v":58191,"d":"58,191"}]
["NUTRIOLOGO",null,"SISTEMA DIF MSICG",113,11,1,{"v":7256,"d":"7,256"},{"v":87072,"d":"87,072"},null,{"v":1194,"d":"1,194"},{"v":11934,"d":"11,934"},{"$nulls":3},{"v":100200,"d":"100,200"}]
["AUXILIAR UBR",null,"SISTEMA DIF MSICG",113,11,1,{"v":5582,"d":"5,582"},{"v":66984,"d":"66,984"},null,918,{"v":9180,"d":"9,180"},{"$nulls":3},{"v":77082,"d":"77,082"}]
["AUXILIAR COCINA",null,"SISTEMA DIF MSICG",113,11,1,{"v":4214,"d":"4,214"},{"v":50568,"d":"50,568"},null,693,{"v":6930,"d":"6,930"},{"$nulls":3},{"v":58191,"d":"58,191"}]
["RECEPCIONISTA",null,"SISTEMA DIF MSICG",113,11,1,{"v":5425,"d":"5,425"},{"v":65100,"d":"65,100"},null,893,{"v":8922,"d":"8,922"},{"$nulls":3},{"v":74915,"d":"74,915"}]
["TRABAJADOR SOCIAL",null,"SISTEMA DIF MSICG",113,11,1,{"v":7703,"d":"7,703"},{"v":92436,"d":"92,436"},null,{"v":1267,"d":"1,267"},{"v":12670,"d":"12,670"},{"$nulls":3},{"v":106373,"d":"106,373"}]
["DIRECTOR",null,"SISTEMA DIF MSICG",113,11,1,{"v":16138,"d":"16,138"},{"v":193656,"d":"193,656"},null,{"v":2655,"d":"2,655"},{"v":26543,"d":"26,543"},{"$nulls":3},{"v":222854,"d":"222,854"}]
["ASISTENCIA ALIMENTARIA",null,"SISTEMA DIF MSICG",113,11,1,{"v":8765,"d":"8,765"},{"v":105180,"d":"105,180"},null,{"v":1442,"d":"1,442"},{"v":14416,"d":"14,416"},{"$nulls":3},{"v":121038,"d":"121,038"}]
[{"$nulls":3},113,{"$nulls":3},"SE REQUIERE ASIGNAR LA FUENTE DE FINANCIAMIENTO",{"$nulls":6},0]
[{"$nulls":3},113,{"$nulls":3},"SE REQUIERE ASIGNAR LA FUENTE DE FINANCIAMIENTO",{"$nulls":6},0]
[{"$nulls":3},113,{"$nulls":3},"SE REQUIERE ASIGNAR LA FUENTE DE FINANCIAMIENTO",{"$nulls":6},0]
[{"$nulls":3},113,{"$nulls":3},"SE REQUIERE ASIGNAR LA FUENTE DE FINANCIAMIENTO",{"$nulls":6},0]
[{"$nulls":3},113,{"$nulls":3},"SE REQUIERE ASIGNAR LA FUENTE DE FINANCIAMIENTO",{"$nulls":6},0]
[{"$nulls":3},113,{"$nulls":3},"SE REQUIERE ASIGNAR LA FUENTE DE FINANCIAMIENTO",{"$nulls":6},0]
[{"$nulls":3},113,{"$nulls":3},"SE REQUIERE ASIGNAR LA FUENTE DE FINANCIAMIENTO",{"$nulls":6},0]
[{"$nulls":3},113,{"$nulls":3},"SE REQUIERE ASIGNAR LA FUENTE DE FINANCIAMIENTO",{"$nulls":6},0]
[{"$nulls":3},113,{"$nulls":3},"SE REQUIERE ASIGNAR LA FUENTE DE FINANCIAMIENTO",{"$nulls":6},0]
[{"$nulls":3},113,{"$nulls":3},"SE REQUIERE ASIGNAR LA FUENTE DE FINANCIAMIENTO",{"$nulls":6},0]
[{"$nulls":3},113,{"$nulls":3},"SE REQUIERE ASIGNAR LA FUENTE DE FINANCIAMIENTO",{"$nulls":6},0]
[{"$nulls":3},113,{"$nulls":3},"SE REQUIERE ASIGNAR LA FUENTE DE FINANCIAMIENTO",{"$nulls":6},0]
[{"$nulls":3},113,{"$nulls":3},"SE REQUIERE ASIGNAR LA FUENTE DE FINANCIAMIENTO",{"$nulls":6},0]
[{"$nulls":3},113,{"$nulls":3},"SE REQUIERE ASIGNAR LA FUENTE DE FINANCIAMIENTO",{"$nulls":6},0]
[{"$nulls":3},113,{"$nulls":3},"SE REQUIERE ASIGNAR LA FUENTE DE FINANCIAMIENTO",{"$nulls":6},0]
[{"$nulls":3},113,{"$nulls":3},"SE REQUIERE ASIGNAR LA FUENTE DE FINANCIAMIENTO",{"$nulls":6},0]
[{"$nulls":3},113,{"$nulls":3},"SE REQUIERE ASIGNAR LA FUENTE DE FINANCIAMIENTO",{"$nulls":6},0]
[{"$nulls":3},113,{"$nulls":3},"SE REQUIERE ASIGNAR LA FUENTE DE FINANCIAMIENTO",{"$nulls":6},0]
[{"$nulls":3},113,{"$nulls":3},"SE REQUIERE ASIGNAR LA FUENTE DE FINANCIAMIENTO",{"$nulls":6},0]
[{"$nulls":3},113,{"$nulls":3},"SE REQUIERE ASIGNAR LA FUENTE DE FINANCIAMIENTO",{"$nulls":6},0]
[{"$nulls":3},113,{"$nulls":3},"SE REQUIERE ASIGNAR LA FUENTE DE FINANCIAMIENTO",{"$nulls":6},0]
[{"$nulls":3},113,{"$nulls":3},"SE REQUIERE ASIGNAR LA FUENTE DE FINANCIAMIENTO",{"$nulls":6},0]
[{"$nulls":3},113,{"$nulls":3},"SE REQUIERE ASIGNAR LA FUENTE DE FINANCIAMIENTO",{"$nulls":6},0]
[{"$nulls":3},113,{"$nulls":3},"SE REQUIERE ASIGNAR LA FUENTE DE FINANCIAMIENTO",{"$nulls":6},0]
[{"$nulls":3},113,{"$nulls":3},"SE REQUIERE ASIGNAR LA FUENTE DE FINANCIAMIENTO",{"$nulls":6},0]
[{"$nulls":3},113,{"$nulls":3},"SE REQUIERE ASIGNAR LA FUENTE DE FINANCIAMIENTO",{"$nulls":6},0]
[{"$nulls":3},113,{"$nulls":3},"SE REQUIERE ASIGNAR LA FUENTE DE FINANCIAMIENTO",{"$nulls":6},0]
[{"$nulls":3},113,{"$nulls":3},"SE REQUIERE ASIGNAR LA FUENTE DE FINANCIAMIENTO",{"$nulls":6},0]
[{"$nulls":3},113,{"$nulls":3},"SE REQUIERE ASIGNAR LA FUENTE DE FINANCIAMIENTO",{"$nulls":6},0]
[{"$nulls":3},113,{"$nulls":3},"SE REQUIERE ASIGNAR LA FUENTE DE FINANCIAMIENTO",{"$nulls":6},0]
[{"$nulls":3},113,{"$nulls":3},"SE REQUIERE ASIGNAR LA FUENTE DE FINANCIAMIENTO",{"$nulls":6},0]
[{"$nulls":3},113,{"$nulls":3},"SE REQUIERE ASIGNAR LA FUENTE DE FINANCIAMIENTO",{"$nulls":6},0]
[{"$nulls":3},113,{"$nulls":3},"SE REQUIERE ASIGNAR LA FUENTE DE FINANCIAMIENTO",{"$nulls":6},0]
[{"$nulls":3},113,{"$nulls":3},"SE REQUIERE ASIGNAR LA FUENTE DE FINANCIAMIENTO",{"$nulls":6},0]
[{"$nulls":3},113,{"$nulls":3},"SE REQUIERE ASIGNAR LA FUENTE DE FINANCIAMIENTO",{"$nulls":6},0]
[{"$nulls":3},113,{"$nulls":3},"SE REQUIERE ASIGNAR LA FUENTE DE FINANCIAMIENTO",{"$nulls":6},0]
[{"$nulls":3},113,{"$nulls":3},"SE REQUIERE ASIGNAR LA FUENTE DE FINANCIAMIENTO",{"$nulls":6},0]
[{"$nulls":3},113,{"$nulls":3},"SE REQUIERE ASIGNAR LA FUENTE DE FINANCIAMIENTO",{"$nulls":6},0]
[{"$nulls":3},113,{"$nulls":3},"SE REQUIERE ASIGNAR LA FUENTE DE FINANCIAMIENTO",{"$nulls":6},0]
[{"$nulls":3},113,{"$nulls":3},"SE REQUIERE ASIGNAR LA FUENTE DE FINANCIAMIENTO",{"$nulls":6},0]
[{"$nulls":3},113,{"$nulls":3},"SE REQUIERE ASIGNAR LA FUENTE DE FINANCIAMIENTO",{"$nulls":6},0]
[{"$nulls":3},113,{"$nulls":3},"SE REQUIERE ASIGNAR LA FUENTE DE FINANCIAMIENTO",{"$nulls":6},0]
[{"$nulls":3},113,{"$nulls":3},"SE REQUIERE ASIGNAR LA FUENTE DE FINANCIAMIENTO",{"$nulls":6},0]
[{"$nulls":3},113,{"$nulls":3},"SE REQUIERE ASIGNAR LA FUENTE DE FINANCIAMIENTO",{"$nulls":6},0]
[{"$nulls":3},113,{"$nulls":3},"SE REQUIERE ASIGNAR LA FUENTE DE FINANCIAMIENTO",{"$nulls":6},0]
[{"$nulls":3},113,{"$nulls":3},"SE REQUIERE ASIGNAR LA FUENTE DE FINANCIAMIENTO",{"$nulls":6},0]
[{"$nulls":3},113,{"$nulls":3},"SE REQUIERE ASIGNAR LA FUENTE DE FINANCIAMIENTO",{"$nulls":6},0]
[{"$nulls":3},113,{"$nulls":3},"SE REQUIERE ASIGNAR LA FUENTE DE FINANCIAMIENTO",{"$nulls":6},0]
[{"$nulls":3},113,{"$nulls":3},"SE REQUIERE ASIGNAR LA FUENTE DE FINANCIAMIENTO",{"$nulls":6},0]
[{"$nulls":3},113,{"$nulls":3},{"$f":"IF(E68=\"\",\"SE REQUIERE ASIGNAR LA FUENTE DE FINANCIAMIENTO\",IF(F68=\"\",\"ES NECESARIO ESTABLECER EL NÚMERO DE PLAZAS\",IF(G68=\"\",\"SE NECESITA ESTABLECER UN MONTO MENSUAL\",F68*G68*12)))","v":"SE REQUIERE ASIGNAR LA FUENTE DE FINANCIAMIENTO"},{"$nulls":6},{"$f":"SUM(H68:N68)","v":0}]
[{"$nulls":3},113,{"$nulls":3},"SE REQUIERE ASIGNAR LA FUENTE DE FINANCIAMIENTO",{"$nulls":6},0]
[{"$nulls":3},113,{"$nulls":3},"SE REQUIERE ASIGNAR LA FUENTE DE FINANCIAMIENTO",{"$nulls":6},0]
[{"$nulls":3},113,{"$nulls":3},"SE REQUIERE ASIGNAR LA FUENTE DE FINANCIAMIENTO",{"$nulls":6},0]
[{"$nulls":3},113,{"$nulls":3},"SE REQUIERE ASIGNAR LA FUENTE DE FINANCIAMIENTO",{"$nulls":6},0]
[{"$nulls":3},113,{"$nulls":3},"SE REQUIERE ASIGNAR LA FUENTE DE FINANCIAMIENTO",{"$nulls":6},0]
[{"$nulls":3},113,{"$nulls":3},"SE REQUIERE ASIGNAR LA FUENTE DE FINANCIAMIENTO",{"$nulls":6},0]
[{"$nulls":3},113,{"$nulls":3},"SE REQUIERE ASIGNAR LA FUENTE DE FINANCIAMIENTO",{"$nulls":6},0]
[{"$nulls":3},113,{"$nulls":3},"SE REQUIERE ASIGNAR LA FUENTE DE FINANCIAMIENTO",{"$nulls":6},0]
[{"$nulls":3},113,{"$nulls":3},"SE REQUIERE ASIGNAR LA FUENTE DE FINANCIAMIENTO",{"$nulls":6},0]
[{"$nulls":3},113,{"$nulls":3},"SE REQUIERE ASIGNAR LA FUENTE DE FINANCIAMIENTO",{"$nulls":6},0]
[{"$nulls":3},113,{"$nulls":3},"SE REQUIERE ASIGNAR LA FUENTE DE FINANCIAMIENTO",{"$nulls":6},0]
[{"$nulls":3},113,{"$nulls":3},"SE REQUIERE ASIGNAR LA FUENTE DE FINANCIAMIENTO",{"$nulls":6},0]
[{"$nulls":3},113,{"$nulls":3},"SE REQUIERE ASIGNAR LA FUENTE DE FINANCIAMIENTO",{"$nulls":6},0]
[{"$nulls":3},113,{"$nulls":3},"SE REQUIERE ASIGNAR LA FUENTE DE FINANCIAMIENTO",{"$nulls":6},0]
[{"$nulls":3},113,{"$nulls":3},"SE REQUIERE ASIGNAR LA FUENTE DE FINANCIAMIENTO",{"$nulls":6},0]
[{"$nulls":3},113,{"$nulls":3},"SE REQUIERE ASIGNAR LA FUENTE DE FINANCIAMIENTO",{"$nulls":6},0]
[{"$nulls":3},113,{"$nulls":3},"SE REQUIERE ASIGNAR LA FUENTE DE FINANCIAMIENTO",{"$nulls":6},0]
[{"$nulls":3},113,{"$nulls":3},"SE REQUIERE ASIGNAR LA FUENTE DE FINANCIAMIENTO",{"$nulls":6},0]
[{"$nulls":3},113,{"$nulls":3},"SE REQUIERE ASIGNAR LA FUENTE DE FINANCIAMIENTO",{"$nulls":6},0]
[{"$nulls":3},113,{"$nulls":3},"SE REQUIERE ASIGNAR LA FUENTE DE FINANCIAMIENTO",{"$nulls":6},0]
[{"$nulls":3},113,{"$nulls":3},"SE REQUIERE ASIGNAR LA FUENTE DE FINANCIAMIENTO",{"$nulls":6},0]
[{"$nulls":3},113,{"$nulls":3},"SE REQUIERE ASIGNAR LA FUENTE DE FINANCIAMIENTO",{"$nulls":6},0]
[{"$nulls":3},113,{"$nulls":3},"SE REQUIERE ASIGNAR LA FUENTE DE FINANCIAMIENTO",{"$nulls":6},0]
[{"$nulls":3},113,{"$nulls":3},"SE REQUIERE ASIGNAR LA FUENTE DE FINANCIAMIENTO",{"$nulls":6},0]
[{"$nulls":3},113,{"$nulls":3},"SE REQUIERE ASIGNAR LA FUENTE DE FINANCIAMIENTO",{"$nulls":6},0]
[{"$nulls":3},113,{"$nulls":3},"SE REQUIERE ASIGNAR LA FUENTE DE FINANCIAMIENTO",{"$nulls":6},0]
[{"$nulls":3},113,{"$nulls":3},"SE REQUIERE ASIGNAR LA FUENTE DE FINANCIAMIENTO",{"$nulls":6},0]
[{"$nulls":3},113,{"$nulls":3},"SE REQUIERE ASIGNAR LA FUENTE DE FINANCIAMIENTO",{"$nulls":6},0]
[{"$nulls":3},113,{"$nulls":3},"SE REQUIERE ASIGNAR LA FUENTE DE FINANCIAMIENTO",{"$nulls":6},0]
[{"$nulls":3},113,{"$nulls":3},"SE REQUIERE ASIGNAR LA FUENTE DE FINANCIAMIENTO",{"$nulls":6},0]
[{"$nulls":3},113,{"$nulls":3},"SE REQUIERE ASIGNAR LA FUENTE DE FINANCIAMIENTO",{"$nulls":6},0]
[{"$nulls":3},113,{"$nulls":3},"SE REQUIERE ASIGNAR LA FUENTE DE FINANCIAMIENTO",{"$nulls":6},0]
[{"$nulls":3},113,{"$nulls":3},"SE REQUIERE ASIGNAR LA FUENTE DE FINANCIAMIENTO",{"$nulls":6},0]
[{"$nulls":3},113,{"$nulls":3},"SE REQUIERE ASIGNAR LA FUENTE DE FINANCIAMIENTO",{"$nulls":6},0]
[{"$nulls":3},113,{"$nulls":3},"SE REQUIERE ASIGNAR LA FUENTE DE FINANCIAMIENTO",{"$nulls":6},0]
[{"$nulls":3},113,{"$nulls":3},"SE REQUIERE ASIGNAR LA FUENTE DE FINANCIAMIENTO",{"$nulls":6},0]
[{"$nulls":3},113,{"$nulls":3},"SE REQUIERE ASIGNAR LA FUENTE DE FINANCIAMIENTO",{"$nulls":6},0]
[{"$nulls":3},113,{"$nulls":3},"SE REQUIERE ASIGNAR LA FUENTE DE FINANCIAMIENTO",{"$nulls":6},0]
[{"$nulls":3},113,{"$nulls":3},"SE REQUIERE ASIGNAR LA FUENTE DE FINANCIAMIENTO",{"$nulls":6},0]
[{"$nulls":3},113,{"$nulls":3},"SE REQUIERE ASIGNAR LA FUENTE DE FINANCIAMIENTO",{"$nulls":6},0]
[{"$nulls":3},113,{"$nulls":3},"SE REQUIERE ASIGNAR LA FUENTE DE FINANCIAMIENTO",{"$nulls":6},0]
[{"$nulls":3},113,{"$nulls":3},"SE REQUIERE ASIGNAR LA FUENTE DE FINANCIAMIENTO",{"$nulls":6},0]
[{"$nulls":3},113,{"$nulls":3},"SE REQUIERE ASIGNAR LA FUENTE DE FINANCIAMIENTO",{"$nulls":6},0]
[{"$nulls":3},113,{"$nulls":3},"SE REQUIERE ASIGNAR LA FUENTE DE FINANCIAMIENTO",{"$nulls":6},0]
[{"$nulls":3},113,{"$nulls":3},"SE REQUIERE ASIGNAR LA FUENTE DE FINANCIAMIENTO",{"$nulls":6},0]
[{"$nulls":3},113,{"$nulls":3},"SE REQUIERE ASIGNAR LA FUENTE DE FINANCIAMIENTO",{"$nulls":6},0]
[{"$nulls":3},113,{"$nulls":3},"SE REQUIERE ASIGNAR LA FUENTE DE FINANCIAMIENTO",{"$nulls":6},0]
[{"$nulls":3},113,{"$nulls":3},"SE REQUIERE ASIGNAR LA FUENTE DE FINANCIAMIENTO",{"$nulls":6},0]
[{"$nulls":3},113,{"$nulls":3},"SE REQUIERE ASIGNAR LA FUENTE DE FINANCIAMIENTO",{"$nulls":6},0]
[{"$nulls":3},113,{"$nulls":3},"SE REQUIERE ASIGNAR LA FUENTE DE FINANCIAMIENTO",{"$nulls":6},0]
[{"$nulls":3},113,{"$nulls":3},"SE REQUIERE ASIGNAR LA FUENTE DE FINANCIAMIENTO",{"$nulls":6},0]
[{"$nulls":3},113,{"$nulls":3},"SE REQUIERE ASIGNAR LA FUENTE DE FINANCIAMIENTO",{"$nulls":6},0]
[{"$nulls":3},113,{"$nulls":3},"SE REQUIERE ASIGNAR LA FUENTE DE FINANCIAMIENTO",{"$nulls":6},0]
[{"$nulls":3},113,{"$nulls":3},"SE REQUIERE ASIGNAR LA FUENTE DE FINANCIAMIENTO",{"$nulls":6},0]
[{"$nulls":3},113,{"$nulls":3},"SE REQUIERE ASIGNAR LA FUENTE DE FINANCIAMIENTO",{"$nulls":6},0]
[{"$nulls":3},113,{"$nulls":3},"SE REQUIERE ASIGNAR LA FUENTE DE FINANCIAMIENTO",{"$nulls":6},0]
[{"$nulls":3},113,{"$nulls":3},"SE REQUIERE ASIGNAR LA FUENTE DE FINANCIAMIENTO",{"$nulls":6},0]
[{"$nulls":3},113,{"$nulls":3},"SE REQUIERE ASIGNAR LA FUENTE DE FINANCIAMIENTO",{"$nulls":6},0]
[{"$nulls":3},113,{"$nulls":3},"SE REQUIERE ASIGNAR LA FUENTE DE FINANCIAMIENTO",{"$nulls":6},0]
[{"$nulls":3},113,{"$nulls":3},"SE REQUIERE ASIGNAR LA FUENTE DE FINANCIAMIENTO",{"$nulls":6},0]
[{"$nulls":3},113,{"$nulls":3},"SE REQUIERE ASIGNAR LA FUENTE DE FINANCIAMIENTO",{"$nulls":6},0]
[{"$nulls":3},113,{"$nulls":3},"SE REQUIERE ASIGNAR LA FUENTE DE FINANCIAMIENTO",{"$nulls":6},0]
[{"$nulls":3},113,{"$nulls":3},"SE REQUIERE ASIGNAR LA FUENTE DE FINANCIAMIENTO",{"$nulls":6},0]
[{"$nulls":3},113,{"$nulls":3},{"$f":"IF(E132=\"\",\"SE REQUIERE ASIGNAR LA FUENTE DE FINANCIAMIENTO\",IF(F132=\"\",\"ES NECESARIO ESTABLECER EL NÚMERO DE PLAZAS\",IF(G132=\"\",\"SE NECESITA ESTABLECER UN MONTO MENSUAL\",F132*G132*12)))","v":"SE REQUIERE ASIGNAR LA FUENTE DE FINANCIAMIENTO"},{"$nulls":6},{"$f":"SUM(H132:N132)","v":0}]
[{"$nulls":3},113,{"$nulls":3},"SE REQUIERE ASIGNAR LA FUENTE DE FINANCIAMIENTO",{"$nulls":6},0]
[{"$nulls":3},113,{"$nulls":3},"SE REQUIERE ASIGNAR LA FUENTE DE FINANCIAMIENTO",{"$nulls":6},0]
[{"$nulls":3},113,{"$nulls":3},"SE REQUIERE ASIGNAR LA FUENTE DE FINANCIAMIENTO",{"$nulls":6},0]
[{"$nulls":3},113,{"$nulls":3},"SE REQUIERE ASIGNAR LA FUENTE DE FINANCIAMIENTO",{"$nulls":6},0]
[{"$nulls":3},113,{"$nulls":3},"SE REQUIERE ASIGNAR LA FUENTE DE FINANCIAMIENTO",{"$nulls":6},0]
[{"$nulls":3},113,{"$nulls":3},"SE REQUIERE ASIGNAR LA FUENTE DE FINANCIAMIENTO",{"$nulls":6},0]
[{"$nulls":3},113,{"$nulls":3},"SE REQUIERE ASIGNAR LA FUENTE DE FINANCIAMIENTO",{"$nulls":6},0]
[{"$nulls":3},113,{"$nulls":3},"SE REQUIERE ASIGNAR LA FUENTE DE FINANCIAMIENTO",{"$nulls":6},0]
[{"$nulls":3},113,{"$nulls":3},"SE REQUIERE ASIGNAR LA FUENTE DE FINANCIAMIENTO",{"$nulls":6},0]
[{"$nulls":3},113,{"$nulls":3},"SE REQUIERE ASIGNAR LA FUENTE DE FINANCIAMIENTO",{"$nulls":6},0]
[{"$nulls":3},113,{"$nulls":3},"SE REQUIERE ASIGNAR LA FUENTE DE FINANCIAMIENTO",{"$nulls":6},0]
[{"$nulls":3},113,{"$nulls":3},"SE REQUIERE ASIGNAR LA FUENTE DE FINANCIAMIENTO",{"$nulls":6},0]
[{"$nulls":3},113,{"$nulls":3},"SE REQUIERE ASIGNAR LA FUENTE DE FINANCIAMIENTO",{"$nulls":6},0]
[{"$nulls":3},113,{"$nulls":3},"SE REQUIERE ASIGNAR LA FUENTE DE FINANCIAMIENTO",{"$nulls":6},0]
[{"$nulls":3},113,{"$nulls":3},"SE REQUIERE ASIGNAR LA FUENTE DE FINANCIAMIENTO",{"$nulls":6},0]
[{"$nulls":3},113,{"$nulls":3},"SE REQUIERE ASIGNAR LA FUENTE DE FINANCIAMIENTO",{"$nulls":6},0]
[{"$nulls":3},113,{"$nulls":3},"SE REQUIERE ASIGNAR LA FUENTE DE FINANCIAMIENTO",{"$nulls":6},0]
[{"$nulls":3},113,{"$nulls":3},"SE REQUIERE ASIGNAR LA FUENTE DE FINANCIAMIENTO",{"$nulls":6},0]
[{"$nulls":3},113,{"$nulls":3},"SE REQUIERE ASIGNAR LA FUENTE DE FINANCIAMIENTO",{"$nulls":6},0]
[{"$nulls":3},113,{"$nulls":3},"SE REQUIERE ASIGNAR LA FUENTE DE FINANCIAMIENTO",{"$nulls":6},0]
[{"$nulls":3},113,{"$nulls":3},"SE REQUIERE ASIGNAR LA FUENTE DE FINANCIAMIENTO",{"$nulls":6},0]
[{"$nulls":3},113,{"$nulls":3},"SE REQUIERE ASIGNAR LA FUENTE DE FINANCIAMIENTO",{"$nulls":6},0]
[{"$nulls":3},113,{"$nulls":3},"SE REQUIERE ASIGNAR LA FUENTE DE FINANCIAMIENTO",{"$nulls":6},0]
[{"$nulls":3},113,{"$nulls":3},"SE REQUIERE ASIGNAR LA FUENTE DE FINANCIAMIENTO",{"$nulls":6},0]
[{"$nulls":3},113,{"$nulls":3},"SE REQUIERE ASIGNAR LA FUENTE DE FINANCIAMIENTO",{"$nulls":6},0]
[{"$nulls":3},113,{"$nulls":3},"SE REQUIERE ASIGNAR LA FUENTE DE FINANCIAMIENTO",{"$nulls":6},0]
[{"$nulls":3},113,{"$nulls":3},"SE REQUIERE ASIGNAR LA FUENTE DE FINANCIAMIENTO",{"$nulls":6},0]
[{"$nulls":3},113,{"$nulls":3},"SE REQUIERE ASIGNAR LA FUENTE DE FINANCIAMIENTO",{"$nulls":6},0]
[{"$nulls":3},113,{"$nulls":3},"SE REQUIERE ASIGNAR LA FUENTE DE FINANCIAMIENTO",{"$nulls":6},0]
[{"$nulls":3},113,{"$nulls":3},"SE REQUIERE ASIGNAR LA FUENTE DE FINANCIAMIENTO",{"$nulls":6},0]
[{"$nulls":3},113,{"$nulls":3},"SE REQUIERE ASIGNAR LA FUENTE DE FINANCIAMIENTO",{"$nulls":6},0]
[{"$nulls":3},113,{"$nulls":3},"SE REQUIERE ASIGNAR LA FUENTE DE FINANCIAMIENTO",{"$nulls":6},0]
[{"$nulls":3},113,{"$nulls":3},"SE REQUIERE ASIGNAR LA FUENTE DE FINANCIAMIENTO",{"$nulls":6},0]
[{"$nulls":3},113,{"$nulls":3},"SE REQUIERE ASIGNAR LA FUENTE DE FINANCIAMIENTO",{"$nulls":6},0]
[{"$nulls":3},113,{"$nulls":3},"SE REQUIERE ASIGNAR LA FUENTE DE FINANCIAMIENTO",{"$nulls":6},0]
[{"$nulls":3},113,{"$nulls":3},"SE REQUIERE ASIGNAR LA FUENTE DE FINANCIAMIENTO",{"$nulls":6},0]
[{"$nulls":3},113,{"$nulls":3},"SE REQUIERE ASIGNAR LA FUENTE DE FINANCIAMIENTO",{"$nulls":6},0]
[{"$nulls":3},113,{"$nulls":3},"SE REQUIERE ASIGNAR LA FUENTE DE FINANCIAMIENTO",{"$nulls":6},0]
[{"$nulls":3},113,{"$nulls":3},"SE REQUIERE ASIGNAR LA FUENTE DE FINANCIAMIENTO",{"$nulls":6},0]
[{"$nulls":3},113,{"$nulls":3},"SE REQUIERE ASIGNAR LA FUENTE DE FINANCIAMIENTO",{"$nulls":6},0]
[{"$nulls":3},113,{"$nulls":3},"SE REQUIERE ASIGNAR LA FUENTE DE FINANCIAMIENTO",{"$nulls":6},0]
[{"$nulls":3},113,{"$nulls":3},"SE REQUIERE ASIGNAR LA FUENTE DE FINANCIAMIENTO",{"$nulls":6},0]
[{"$nulls":3},113,{"$nulls":3},"SE REQUIERE ASIGNAR LA FUENTE DE FINANCIAMIENTO",{"$nulls":6},0]
[{"$nulls":3},113,{"$nulls":3},"SE REQUIERE ASIGNAR LA FUENTE DE FINANCIAMIENTO",{"$nulls":6},0]
[{"$nulls":3},113,{"$nulls":3},"SE REQUIERE ASIGNAR LA FUENTE DE FINANCIAMIENTO",{"$nulls":6},0]
[{"$nulls":3},113,{"$nulls":3},"SE REQUIERE ASIGNAR LA FUENTE DE FINANCIAMIENTO",{"$nulls":6},0]
[{"$nulls":3},113,{"$nulls":3},"SE REQUIERE ASIGNAR LA FUENTE DE FINANCIAMIENTO",{"$nulls":6},0]
[{"$nulls":3},113,{"$nulls":3},"SE REQUIERE ASIGNAR LA FUENTE DE FINANCIAMIENTO",{"$nulls":6},0]
[{"$nulls":3},113,{"$nulls":3},"SE REQUIERE ASIGNAR LA FUENTE DE FINANCIAMIENTO",{"$nulls":6},0]
[{"$nulls":3},113,{"$nulls":3},"SE REQUIERE ASIGNAR LA FUENTE DE FINANCIAMIENTO",{"$nulls":6},0]
[{"$nulls":3},113,{"$nulls":3},"SE REQUIERE ASIGNAR LA FUENTE DE FINANCIAMIENTO",{"$nulls":6},0]
[{"$nulls":3},113,{"$nulls":3},"SE REQUIERE ASIGNAR LA FUENTE DE FINANCIAMIENTO",{"$nulls":6},0]
[{"$nulls":3},113,{"$nulls":3},"SE REQUIERE ASIGNAR LA FUENTE DE FINANCIAMIENTO",{"$nulls":6},0]
[{"$nulls":3},113,{"$nulls":3},"SE REQUIERE ASIGNAR LA FUENTE DE FINANCIAMIENTO",{"$nulls":6},0]
[{"$nulls":3},113,{"$nulls":3},"SE REQUIERE ASIGNAR LA FUENTE DE FINANCIAMIENTO",{"$nulls":6},0]
[{"$nulls":3},113,{"$nulls":3},"SE REQUIERE ASIGNAR LA FUENTE DE FINANCIAMIENTO",{"$nulls":6},0]
[{"$nulls":3},113,{"$nulls":3},"SE REQUIERE ASIGNAR LA FUENTE DE FINANCIAMIENTO",{"$nulls":6},0]
[{"$nulls":3},113,{"$nulls":3},"SE REQUIERE ASIGNAR LA FUENTE DE FINANCIAMIENTO",{"$nulls":6},0]
[{"$nulls":3},113,{"$nulls":3},"SE REQUIERE ASIGNAR LA FUENTE DE FINANCIAMIENTO",{"$nulls":6},0]
[{"$nulls":3},113,{"$nulls":3},"SE REQUIERE ASIGNAR LA FUENTE DE FINANCIAMIENTO",{"$nulls":6},0]
[{"$nulls":3},113,{"$nulls":3},"SE REQUIERE ASIGNAR LA FUENTE DE FINANCIAMIENTO",{"$nulls":6},0]
[{"$nulls":3},113,{"$nulls":3},"SE REQUIERE ASIGNAR LA FUENTE DE FINANCIAMIENTO",{"$nulls":6},0]
[{"$nulls":3},113,{"$nulls":3},"SE REQUIERE ASIGNAR LA FUENTE DE FINANCIAMIENTO",{"$nulls":6},0]
[{"$nulls":3},113,{"$nulls":3},{"$f":"IF(E196=\"\",\"SE REQUIERE ASIGNAR LA FUENTE DE FINANCIAMIENTO\",IF(F196=\"\",\"ES NECESARIO ESTABLECER EL NÚMERO DE PLAZAS\",IF(G196=\"\",\"SE NECESITA ESTABLECER UN MONTO MENSUAL\",F196*G196*12)))","v":"SE REQUIERE ASIGNAR LA FUENTE DE FINANCIAMIENTO"},{"$nulls":6},{"$f":"SUM(H196:N196)","v":0}]
[{"$nulls":3},113,{"$nulls":3},"SE REQUIERE ASIGNAR LA FUENTE DE FINANCIAMIENTO",{"$nulls":6},0]
[{"$nulls":3},113,{"$nulls":3},"SE REQUIERE ASIGNAR LA FUENTE DE FINANCIAMIENTO",{"$nulls":6},0]
[{"$nulls":3},113,{"$nulls":3},"SE REQUIERE ASIGNAR LA FUENTE DE FINANCIAMIENTO",{"$nulls":6},0]
[{"$nulls":3},113,{"$nulls":3},"SE REQUIERE ASIGNAR LA FUENTE DE FINANCIAMIENTO",{"$nulls":6},0]
[{"$nulls":3},113,{"$nulls":3},"SE REQUIERE ASIGNAR LA FUENTE DE FINANCIAMIENTO",{"$nulls":6},0]
[{"$nulls":3},113,{"$nulls":3},"SE REQUIERE ASIGNAR LA FUENTE DE FINANCIAMIENTO",{"$nulls":6},0]
[{"$nulls":3},113,{"$nulls":3},"SE REQUIERE ASIGNAR LA FUENTE DE FINANCIAMIENTO",{"$nulls":6},0]
[{"$nulls":3},113,{"$nulls":3},"SE REQUIERE ASIGNAR LA FUENTE DE FINANCIAMIENTO",{"$nulls":6},0]
[{"$nulls":3},113,{"$nulls":3},"SE REQUIERE ASIGNAR LA FUENTE DE FINANCIAMIENTO",{"$nulls":6},0]
[{"$nulls":3},113,{"$nulls":3},"SE REQUIERE ASIGNAR LA FUENTE DE FINANCIAMIENTO",{"$nulls":6},0]
[{"$nulls":3},113,{"$nulls":3},"SE REQUIERE ASIGNAR LA FUENTE DE FINANCIAMIENTO",{"$nulls":6},0]
[{"$nulls":3},113,{"$nulls":3},"SE REQUIERE ASIGNAR LA FUENTE DE FINANCIAMIENTO",{"$nulls":6},0]
[{"$nulls":3},113,{"$nulls":3},"SE REQUIERE ASIGNAR LA FUENTE DE FINANCIAMIENTO",{"$nulls":6},0]
[{"$nulls":3},113,{"$nulls":3},"SE REQUIERE ASIGNAR LA FUENTE DE FINANCIAMIENTO",{"$nulls":6},0]
[{"$nulls":3},113,{"$nulls":3},"SE REQUIERE ASIGNAR LA FUENTE DE FINANCIAMIENTO",{"$nulls":6},0]
[{"$nulls":3},113,{"$nulls":3},"SE REQUIERE ASIGNAR LA FUENTE DE FINANCIAMIENTO",{"$nulls":6},0]
[{"$nulls":3},113,{"$nulls":3},"SE REQUIERE ASIGNAR LA FUENTE DE FINANCIAMIENTO",{"$nulls":6},0]
[{"$nulls":3},113,{"$nulls":3},"SE REQUIERE ASIGNAR LA FUENTE DE FINANCIAMIENTO",{"$nulls":6},0]
[{"$nulls":3},113,{"$nulls":3},"SE REQUIERE ASIGNAR LA FUENTE DE FINANCIAMIENTO",{"$nulls":6},0]
[{"$nulls":3},113,{"$nulls":3},"SE REQUIERE ASIGNAR LA FUENTE DE FINANCIAMIENTO",{"$nulls":6},0]
[{"$nulls":3},113,{"$nulls":3},"SE REQUIERE ASIGNAR LA FUENTE DE FINANCIAMIENTO",{"$nulls":6},0]
[{"$nulls":3},113,{"$nulls":3},"SE REQUIERE ASIGNAR LA FUENTE DE FINANCIAMIENTO",{"$nulls":6},0]
[{"$nulls":3},113,{"$nulls":3},"SE REQUIERE ASIGNAR LA FUENTE DE FINANCIAMIENTO",{"$nulls":6},0]
[{"$nulls":3},113,{"$nulls":3},"SE REQUIERE ASIGNAR LA FUENTE DE FINANCIAMIENTO",{"$nulls":6},0]
[{"$nulls":3},113,{"$nulls":3},"SE REQUIERE ASIGNAR LA FUENTE DE FINANCIAMIENTO",{"$nulls":6},0]
[{"$nulls":3},113,{"$nulls":3},"SE REQUIERE ASIGNAR LA FUENTE DE FINANCIAMIENTO",{"$nulls":6},0]
[{"$nulls":3},113,{"$nulls":3},"SE REQUIERE ASIGNAR LA FUENTE DE FINANCIAMIENTO",{"$nulls":6},0]
[{"$nulls":3},113,{"$nulls":3},"SE REQUIERE ASIGNAR LA FUENTE DE FINANCIAMIENTO",{"$nulls":6},0]
[{"$nulls":3},113,{"$nulls":3},"SE REQUIERE ASIGNAR LA FUENTE DE FINANCIAMIENTO",{"$nulls":6},0]
[{"$nulls":3},113,{"$nulls":3},"SE REQUIERE ASIGNAR LA FUENTE DE FINANCIAMIENTO",{"$nulls":6},0]
[{"$nulls":3},113,{"$nulls":3},"SE REQUIERE ASIGNAR LA FUENTE DE FINANCIAMIENTO",{"$nulls":6},0]
[{"$nulls":3},113,{"$nulls":3},"SE REQUIERE ASIGNAR LA FUENTE DE FINANCIAMIENTO",{"$nulls":6},0]
[{"$nulls":3},113,{"$nulls":3},"SE REQUIERE ASIGNAR LA FUENTE DE FINANCIAMIENTO",{"$nulls":6},0]
[{"$nulls":3},113,{"$nulls":3},"SE REQUIERE ASIGNAR LA FUENTE DE FINANCIAMIENTO",{"$nulls":6},0]
[{"$nulls":3},113,{"$nulls":3},"SE REQUIERE ASIGNAR LA FUENTE DE FINANCIAMIENTO",{"$nulls":6},0]
[{"$nulls":3},113,{"$nulls":3},"SE REQUIERE ASIGNAR LA FUENTE DE FINANCIAMIENTO",{"$nulls":6},0]
[{"$nulls":3},113,{"$nulls":3},"SE REQUIERE ASIGNAR LA FUENTE DE FINANCIAMIENTO",{"$nulls":6},0]
[{"$nulls":3},113,{"$nulls":3},"SE REQUIERE ASIGNAR LA FUENTE DE FINANCIAMIENTO",{"$nulls":6},0]
[{"$nulls":3},113,{"$nulls":3},"SE REQUIERE ASIGNAR LA FUENTE DE FINANCIAMIENTO",{"$nulls":6},0]
[{"$nulls":3},113,{"$nulls":3},"SE REQUIERE ASIGNAR LA FUENTE DE FINANCIAMIENTO",{"$nulls":6},0]
[{"$nulls":3},113,{"$nulls":3},"SE REQUIERE ASIGNAR LA FUENTE DE FINANCIAMIENTO",{"$nulls":6},0]
[{"$nulls":3},113,{"$nulls":3},"SE REQUIERE ASIGNAR LA FUENTE DE FINANCIAMIENTO",{"$nulls":6},0]
[{"$nulls":3},113,{"$nulls":3},"SE REQUIERE ASIGNAR LA FUENTE DE FINANCIAMIENTO",{"$nulls":6},0]
[{"$nulls":3},113,{"$nulls":3},"SE REQUIERE ASIGNAR LA FUENTE DE FINANCIAMIENTO",{"$nulls":6},0]
[{"$nulls":3},113,{"$nulls":3},"SE REQUIERE ASIGNAR LA FUENTE DE FINANCIAMIENTO",{"$nulls":6},0]
[{"$nulls":3},113,{"$nulls":3},"SE REQUIERE ASIGNAR LA FUENTE DE FINANCIAMIENTO",{"$nulls":6},0]
[{"$nulls":3},113,{"$nulls":3},"SE REQUIERE ASIGNAR LA FUENTE DE FINANCIAMIENTO",{"$nulls":6},0]
[{"$nulls":3},113,{"$nulls":3},"SE REQUIERE ASIGNAR LA FUENTE DE FINANCIAMIENTO",{"$nulls":6},0]
[{"$nulls":3},113,{"$nulls":3},"SE REQUIERE ASIGNAR LA FUENTE DE FINANCIAMIENTO",{"$nulls":6},0]
[{"$nulls":3},113,{"$nulls":3},"SE REQUIERE ASIGNAR LA FUENTE DE FINANCIAMIENTO",{"$nulls":6},0]
[{"$nulls":3},113,{"$nulls":3},"SE REQUIERE ASIGNAR LA FUENTE DE FINANCIAMIENTO",{"$nulls":6},0]
[{"$nulls":3},113,{"$nulls":3},"SE REQUIERE ASIGNAR LA FUENTE DE FINANCIAMIENTO",{"$nulls":6},0]
[{"$nulls":3},113,{"$nulls":3},"SE REQUIERE ASIGNAR LA FUENTE DE FINANCIAMIENTO",{"$nulls":6},0]
[{"$nulls":3},113,{"$nulls":3},"SE REQUIERE ASIGNAR LA FUENTE DE FINANCIAMIENTO",{"$nulls":6},0]
[{"$nulls":3},113,{"$nulls":3},"SE REQUIERE ASIGNAR LA FUENTE DE FINANCIAMIENTO",{"$nulls":6},0]
[{"$nulls":3},113,{"$nulls":3},"SE REQUIERE ASIGNAR LA FUENTE DE FINANCIAMIENTO",{"$nulls":6},0]
[{"$nulls":3},113,{"$nulls":3},"SE REQUIERE ASIGNAR LA FUENTE DE FINANCIAMIENTO",{"$nulls":6},0]
[{"$nulls":3},113,{"$nulls":3},"SE REQUIERE ASIGNAR LA FUENTE DE FINANCIAMIENTO",{"$nulls":6},0]
[{"$nulls":3},113,{"$nulls":3},"SE REQUIERE ASIGNAR LA FUENTE DE FINANCIAMIENTO",{"$nulls":6},0]
[{"$nulls":3},113,{"$nulls":3},"SE REQUIERE ASIGNAR LA FUENTE DE FINANCIAMIENTO",{"$nulls":6},0]
[{"$nulls":3},113,{"$nulls":3},"SE REQUIERE ASIGNAR LA FUENTE DE FINANCIAMIENTO",{"$nulls":6},0]
[{"$nulls":3},113,{"$nulls":3},"SE REQUIERE ASIGNAR LA FUENTE DE FINANCIAMIENTO",{"$nulls":6},0]
[{"$nulls":3},113,{"$nulls":3},"SE REQUIERE ASIGNAR LA FUENTE DE FINANCIAMIENTO",{"$nulls":6},0]
[{"$nulls":3},113,{"$nulls":3},{"$f":"IF(E260=\"\",\"SE REQUIERE ASIGNAR LA FUENTE DE FINANCIAMIENTO\",IF(F260=\"\",\"ES NECESARIO ESTABLECER EL NÚMERO DE PLAZAS\",IF(G260=\"\",\"SE NECESITA ESTABLECER UN MONTO MENSUAL\",F260*G260*12)))","v":"SE REQUIERE ASIGNAR LA FUENTE DE FINANCIAMIENTO"},{"$nulls":6},{"$f":"SUM(H260:N260)","v":0}]
[{"$nulls":3},113,{"$nulls":3},"SE REQUIERE ASIGNAR LA FUENTE DE FINANCIAMIENTO",{"$nulls":6},0]
[{"$nulls":3},113,{"$nulls":3},"SE REQUIERE ASIGNAR LA FUENTE DE FINANCIAMIENTO",{"$nulls":6},0]
[{"$nulls":3},113,{"$nulls":3},"SE REQUIERE ASIGNAR LA FUENTE DE FINANCIAMIENTO",{"$nulls":6},0]
[{"$nulls":3},113,{"$nulls":3},"SE REQUIERE ASIGNAR LA FUENTE DE FINANCIAMIENTO",{"$nulls":6},0]
[{"$nulls":3},113,{"$nulls":3},"SE REQUIERE ASIGNAR LA FUENTE DE FINANCIAMIENTO",{"$nulls":6},0]
[{"$nulls":3},113,{"$nulls":3},"SE REQUIERE ASIGNAR LA FUENTE DE FINANCIAMIENTO",{"$nulls":6},0]
[{"$nulls":3},113,{"$nulls":3},"SE REQUIERE ASIGNAR LA FUENTE DE FINANCIAMIENTO",{"$nulls":6},0]
[{"$nulls":3},113,{"$nulls":3},"SE REQUIERE ASIGNAR LA FUENTE DE FINANCIAMIENTO",{"$nulls":6},0]
[{"$nulls":3},113,{"$nulls":3},"SE REQUIERE ASIGNAR LA FUENTE DE FINANCIAMIENTO",{"$nulls":6},0]
[{"$nulls":3},113,{"$nulls":3},"SE REQUIERE ASIGNAR LA FUENTE DE FINANCIAMIENTO",{"$nulls":6},0]
[{"$nulls":3},113,{"$nulls":3},"SE REQUIERE ASIGNAR LA FUENTE DE FINANCIAMIENTO",{"$nulls":6},0]
[{"$nulls":3},113,{"$nulls":3},"SE REQUIERE ASIGNAR LA FUENTE DE FINANCIAMIENTO",{"$nulls":6},0]
[{"$nulls":3},113,{"$nulls":3},"SE REQUIERE ASIGNAR LA FUENTE DE FINANCIAMIENTO",{"$nulls":6},0]
[{"$nulls":3},113,{"$nulls":3},"SE REQUIERE ASIGNAR LA FUENTE DE FINANCIAMIENTO",{"$nulls":6},0]
[{"$nulls":3},113,{"$nulls":3},"SE REQUIERE ASIGNAR LA FUENTE DE FINANCIAMIENTO",{"$nulls":6},0]
[{"$nulls":3},113,{"$nulls":3},"SE REQUIERE ASIGNAR LA FUENTE DE FINANCIAMIENTO",{"$nulls":6},0]
[{"$nulls":3},113,{"$nulls":3},"SE REQUIERE ASIGNAR LA FUENTE DE FINANCIAMIENTO",{"$nulls":6},0]
[{"$nulls":3},113,{"$nulls":3},"SE REQUIERE ASIGNAR LA FUENTE DE FINANCIAMIENTO",{"$nulls":6},0]
[{"$nulls":3},113,{"$nulls":3},"SE REQUIERE ASIGNAR LA FUENTE DE FINANCIAMIENTO",{"$nulls":6},0]
[{"$nulls":3},113,{"$nulls":3},"SE REQUIERE ASIGNAR LA FUENTE DE FINANCIAMIENTO",{"$nulls":6},0]
[{"$nulls":3},113,{"$nulls":3},"SE REQUIERE ASIGNAR LA FUENTE DE FINANCIAMIENTO",{"$nulls":6},0]
[{"$nulls":3},113,{"$nulls":3},"SE REQUIERE ASIGNAR LA FUENTE DE FINANCIAMIENTO",{"$nulls":6},0]
[{"$nulls":3},113,{"$nulls":3},"SE REQUIERE ASIGNAR LA FUENTE DE FINANCIAMIENTO",{"$nulls":6},0]
[{"$nulls":3},113,{"$nulls":3},"SE REQUIERE ASIGNAR LA FUENTE DE FINANCIAMIENTO",{"$nulls":6},0]
[{"$nulls":3},113,{"$nulls":3},"SE REQUIERE ASIGNAR LA FUENTE DE FINANCIAMIENTO",{"$nulls":6},0]
[{"$nulls":3},113,{"$nulls":3},"SE REQUIERE ASIGNAR LA FUENTE DE FINANCIAMIENTO",{"$nulls":6},0]
[{"$nulls":3},113,{"$nulls":3},"SE REQUIERE ASIGNAR LA FUENTE DE FINANCIAMIENTO",{"$nulls":6},0]
[{"$nulls":3},113,{"$nulls":3},"SE REQUIERE ASIGNAR LA FUENTE DE FINANCIAMIENTO",{"$nulls":6},0]
[{"$nulls":3},113,{"$nulls":3},"SE REQUIERE ASIGNAR LA FUENTE DE FINANCIAMIENTO",{"$nulls":6},0]
[{"$nulls":3},113,{"$nulls":3},"SE REQUIERE ASIGNAR LA FUENTE DE FINANCIAMIENTO",{"$nulls":6},0]
[{"$nulls":3},113,{"$nulls":3},"SE REQUIERE ASIGNAR LA FUENTE DE FINANCIAMIENTO",{"$nulls":6},0]
[{"$nulls":3},113,{"$nulls":3},"SE REQUIERE ASIGNAR LA FUENTE DE FINANCIAMIENTO",{"$nulls":6},0]
[{"$nulls":3},113,{"$nulls":3},"SE REQUIERE ASIGNAR LA FUENTE DE FINANCIAMIENTO",{"$nulls":6},0]
[{"$nulls":3},113,{"$nulls":3},"SE REQUIERE ASIGNAR LA FUENTE DE FINANCIAMIENTO",{"$nulls":6},0]
[{"$nulls":3},113,{"$nulls":3},"SE REQUIERE ASIGNAR LA FUENTE DE FINANCIAMIENTO",{"$nulls":6},0]
[{"$nulls":3},113,{"$nulls":3},"SE REQUIERE ASIGNAR LA FUENTE DE FINANCIAMIENTO",{"$nulls":6},0]
[{"$nulls":3},113,{"$nulls":3},"SE REQUIERE ASIGNAR LA FUENTE DE FINANCIAMIENTO",{"$nulls":6},0]
[{"$nulls":3},113,{"$nulls":3},"SE REQUIERE ASIGNAR LA FUENTE DE FINANCIAMIENTO",{"$nulls":6},0]
[{"$nulls":3},113,{"$nulls":3},"SE REQUIERE ASIGNAR LA FUENTE DE FINANCIAMIENTO",{"$nulls":6},0]
[{"$nulls":3},113,{"$nulls":3},"SE REQUIERE ASIGNAR LA FUENTE DE FINANCIAMIENTO",{"$nulls":6},0]
[{"$nulls":3},113,{"$nulls":3},"SE REQUIERE ASIGNAR LA FUENTE DE FINANCIAMIENTO",{"$nulls":6},0]
[{"$nulls":3},113,{"$nulls":3},"SE REQUIERE ASIGNAR LA FUENTE DE FINANCIAMIENTO",{"$nulls":6},0]
[{"$nulls":3},113,{"$nulls":3},"SE REQUIERE ASIGNAR LA FUENTE DE FINANCIAMIENTO",{"$nulls":6},0]
[{"$nulls":3},113,{"$nulls":3},"SE REQUIERE ASIGNAR LA FUENTE DE FINANCIAMIENTO",{"$nulls":6},0]
[{"$nulls":3},113,{"$nulls":3},"SE REQUIERE ASIGNAR LA FUENTE DE FINANCIAMIENTO",{"$nulls":6},0]
[{"$nulls":3},113,{"$nulls":3},"SE REQUIERE ASIGNAR LA FUENTE DE FINANCIAMIENTO",{"$nulls":6},0]
[{"$nulls":3},113,{"$nulls":3},"SE REQUIERE ASIGNAR LA FUENTE DE FINANCIAMIENTO",{"$nulls":6},0]
[{"$nulls":3},113,{"$nulls":3},"SE REQUIERE ASIGNAR LA FUENTE DE FINANCIAMIENTO",{"$nulls":6},0]
[{"$nulls":3},113,{"$nulls":3},"SE REQUIERE ASIGNAR LA FUENTE DE FINANCIAMIENTO",{"$nulls":6},0]
[{"$nulls":3},113,{"$nulls":3},"SE REQUIERE ASIGNAR LA FUENTE DE FINANCIAMIENTO",{"$nulls":6},0]
[{"$nulls":3},113,{"$nulls":3},"SE REQUIERE ASIGNAR LA FUENTE DE FINANCIAMIENTO",{"$nulls":6},0]
[{"$nulls":3},113,{"$nulls":3},"SE REQUIERE ASIGNAR LA FUENTE DE FINANCIAMIENTO",{"$nulls":6},0]
[{"$nulls":3},113,{"$nulls":3},"SE REQUIERE ASIGNAR LA FUENTE DE FINANCIAMIENTO",{"$nulls":6},0]
[{"$nulls":3},113,{"$nulls":3},"SE REQUIERE ASIGNAR LA FUENTE DE FINANCIAMIENTO",{"$nulls":6},0]
[{"$nulls":3},113,{"$nulls":3},"SE REQUIERE ASIGNAR LA FUENTE DE FINANCIAMIENTO",{"$nulls":6},0]
[{"$nulls":3},113,{"$nulls":3},"SE REQUIERE ASIGNAR LA FUENTE DE FINANCIAMIENTO",{"$nulls":6},0]
[{"$nulls":3},113,{"$nulls":3},"SE REQUIERE ASIGNAR LA FUENTE DE FINANCIAMIENTO",{"$nulls":6},0]
[{"$nulls":3},113,{"$nulls":3},"SE REQUIERE ASIGNAR LA FUENTE DE FINANCIAMIENTO",{"$nulls":6},0]
[{"$nulls":3},113,{"$nulls":3},"SE REQUIERE ASIGNAR LA FUENTE DE FINANCIAMIENTO",{"$nulls":6},0]
[{"$nulls":3},113,{"$nulls":3},"SE REQUIERE ASIGNAR LA FUENTE DE FINANCIAMIENTO",{"$nulls":6},0]
[{"$nulls":3},113,{"$nulls":3},"SE REQUIERE ASIGNAR LA FUENTE DE FINANCIAMIENTO",{"$nulls":6},0]
[{"$nulls":3},113,{"$nulls":3},"SE REQUIERE ASIGNAR LA FUENTE DE FINANCIAMIENTO",{"$nulls":6},0]
[{"$nulls":3},113,{"$nulls":3},"SE REQUIERE ASIGNAR LA FUENTE DE FINANCIAMIENTO",{"$nulls":6},0]
[{"$nulls":3},113,{"$nulls":3},{"$f":"IF(E324=\"\",\"SE REQUIERE ASIGNAR LA FUENTE DE FINANCIAMIENTO\",IF(F324=\"\",\"ES NECESARIO ESTABLECER EL NÚMERO DE PLAZAS\",IF(G324=\"\",\"SE NECESITA ESTABLECER UN MONTO MENSUAL\",F324*G324*12)))","v":"SE REQUIERE ASIGNAR LA FUENTE DE FINANCIAMIENTO"},{"$nulls":6},{"$f":"SUM(H324:N324)","v":0}]
[{"$nulls":3},113,{"$nulls":3},"SE REQUIERE ASIGNAR LA FUENTE DE FINANCIAMIENTO",{"$nulls":6},0]
[{"$nulls":3},113,{"$nulls":3},"SE REQUIERE ASIGNAR LA FUENTE DE FINANCIAMIENTO",{"$nulls":6},0]
[{"$nulls":3},113,{"$nulls":3},"SE REQUIERE ASIGNAR LA FUENTE DE FINANCIAMIENTO",{"$nulls":6},0]
[{"$nulls":3},113,{"$nulls":3},"SE REQUIERE ASIGNAR LA FUENTE DE FINANCIAMIENTO",{"$nulls":6},0]
[{"$nulls":3},113,{"$nulls":3},"SE REQUIERE ASIGNAR LA FUENTE DE FINANCIAMIENTO",{"$nulls":6},0]
[{"$nulls":3},113,{"$nulls":3},"SE REQUIERE ASIGNAR LA FUENTE DE FINANCIAMIENTO",{"$nulls":6},0]
[{"$nulls":3},113,{"$nulls":3},"SE REQUIERE ASIGNAR LA FUENTE DE FINANCIAMIENTO",{"$nulls":6},0]
[{"$nulls":3},113,{"$nulls":3},"SE REQUIERE ASIGNAR LA FUENTE DE FINANCIAMIENTO",{"$nulls":6},0]
[{"$nulls":3},113,{"$nulls":3},"SE REQUIERE ASIGNAR LA FUENTE DE FINANCIAMIENTO",{"$nulls":6},0]
[{"$nulls":3},113,{"$nulls":3},"SE REQUIERE ASIGNAR LA FUENTE DE FINANCIAMIENTO",{"$nulls":6},0]
[{"$nulls":3},113,{"$nulls":3},"SE REQUIERE ASIGNAR LA FUENTE DE FINANCIAMIENTO",{"$nulls":6},0]
[{"$nulls":3},113,{"$nulls":3},"SE REQUIERE ASIGNAR LA FUENTE DE FINANCIAMIENTO",{"$nulls":6},0]
[{"$nulls":3},113,{"$nulls":3},"SE REQUIERE ASIGNAR LA FUENTE DE FINANCIAMIENTO",{"$nulls":6},0]
[{"$nulls":3},113,{"$nulls":3},"SE REQUIERE ASIGNAR LA FUENTE DE FINANCIAMIENTO",{"$nulls":6},0]
[{"$nulls":3},113,{"$nulls":3},"SE REQUIERE ASIGNAR LA FUENTE DE FINANCIAMIENTO",{"$nulls":6},0]
[{"$nulls":3},113,{"$nulls":3},"SE REQUIERE ASIGNAR LA FUENTE DE FINANCIAMIENTO",{"$nulls":6},0]
[{"$nulls":3},113,{"$nulls":3},"SE REQUIERE ASIGNAR LA FUENTE DE FINANCIAMIENTO",{"$nulls":6},0]
[{"$nulls":3},113,{"$nulls":3},"SE REQUIERE ASIGNAR LA FUENTE DE FINANCIAMIENTO",{"$nulls":6},0]
[{"$nulls":3},113,{"$nulls":3},"SE REQUIERE ASIGNAR LA FUENTE DE FINANCIAMIENTO",{"$nulls":6},0]
[{"$nulls":3},113,{"$nulls":3},"SE REQUIERE ASIGNAR LA FUENTE DE FINANCIAMIENTO",{"$nulls":6},0]
[{"$nulls":3},113,{"$nulls":3},"SE REQUIERE ASIGNAR LA FUENTE DE FINANCIAMIENTO",{"$nulls":6},0]
[{"$nulls":3},113,{"$nulls":3},"SE REQUIERE ASIGNAR LA FUENTE DE FINANCIAMIENTO",{"$nulls":6},0]
[{"$nulls":3},113,{"$nulls":3},"SE REQUIERE ASIGNAR LA FUENTE DE FINANCIAMIENTO",{"$nulls":6},0]
[{"$nulls":3},113,{"$nulls":3},"SE REQUIERE ASIGNAR LA FUENTE DE FINANCIAMIENTO",{"$nulls":6},0]
[{"$nulls":3},113,{"$nulls":3},"SE REQUIERE ASIGNAR LA FUENTE DE FINANCIAMIENTO",{"$nulls":6},0]
[{"$nulls":3},113,{"$nulls":3},"SE REQUIERE ASIGNAR LA FUENTE DE FINANCIAMIENTO",{"$nulls":6},0]
[{"$nulls":3},113,{"$nulls":3},"SE REQUIERE ASIGNAR LA FUENTE DE FINANCIAMIENTO",{"$nulls":6},0]
[{"$nulls":3},113,{"$nulls":3},"SE REQUIERE ASIGNAR LA FUENTE DE FINANCIAMIENTO",{"$nulls":6},0]
[{"$nulls":3},113,{"$nulls":3},"SE REQUIERE ASIGNAR LA FUENTE DE FINANCIAMIENTO",{"$nulls":6},0]
[{"$nulls":3},113,{"$nulls":3},"SE REQUIERE ASIGNAR LA FUENTE DE FINANCIAMIENTO",{"$nulls":6},0]
[{"$nulls":3},113,{"$nulls":3},"SE REQUIERE ASIGNAR LA FUENTE DE FINANCIAMIENTO",{"$nulls":6},0]
[{"$nulls":3},113,{"$nulls":3},"SE REQUIERE ASIGNAR LA FUENTE DE FINANCIAMIENTO",{"$nulls":6},0]
[{"$nulls":3},113,{"$nulls":3},"SE REQUIERE ASIGNAR LA FUENTE DE FINANCIAMIENTO",{"$nulls":6},0]
[{"$nulls":3},113,{"$nulls":3},"SE REQUIERE ASIGNAR LA FUENTE DE FINANCIAMIENTO",{"$nulls":6},0]
[{"$nulls":3},113,{"$nulls":3},"SE REQUIERE ASIGNAR LA FUENTE DE FINANCIAMIENTO",{"$nulls":6},0]
[{"$nulls":3},113,{"$nulls":3},"SE REQUIERE ASIGNAR LA FUENTE DE FINANCIAMIENTO",{"$nulls":6},0]
[{"$nulls":3},113,{"$nulls":3},"SE REQUIERE ASIGNAR LA FUENTE DE FINANCIAMIENTO",{"$nulls":6},0]
[{"$nulls":3},113,{"$nulls":3},"SE REQUIERE ASIGNAR LA FUENTE DE FINANCIAMIENTO",{"$nulls":6},0]
[{"$nulls":3},113,{"$nulls":3},"SE REQUIERE ASIGNAR LA FUENTE DE FINANCIAMIENTO",{"$nulls":6},0]
[{"$nulls":3},113,{"$nulls":3},"SE REQUIERE ASIGNAR LA FUENTE DE FINANCIAMIENTO",{"$nulls":6},0]
[{"$nulls":3},113,{"$nulls":3},"SE REQUIERE ASIGNAR LA FUENTE DE FINANCIAMIENTO",{"$nulls":6},0]
[{"$nulls":3},113,{"$nulls":3},"SE REQUIERE ASIGNAR LA FUENTE DE FINANCIAMIENTO",{"$nulls":6},0]
[{"$nulls":3},113,{"$nulls":3},"SE REQUIERE ASIGNAR LA FUENTE DE FINANCIAMIENTO",{"$nulls":6},0]
[{"$nulls":3},113,{"$nulls":3},"SE REQUIERE ASIGNAR LA FUENTE DE FINANCIAMIENTO",{"$nulls":6},0]
[{"$nulls":3},113,{"$nulls":3},"SE REQUIERE ASIGNAR LA FUENTE DE FINANCIAMIENTO",{"$nulls":6},0]
[{"$nulls":3},113,{"$nulls":3},"SE REQUIERE ASIGNAR LA FUENTE DE FINANCIAMIENTO",{"$nulls":6},0]
[{"$nulls":3},113,{"$nulls":3},"SE REQUIERE ASIGNAR LA FUENTE DE FINANCIAMIENTO",{"$nulls":6},0]
[{"$nulls":3},113,{"$nulls":3},"SE REQUIERE ASIGNAR LA FUENTE DE FINANCIAMIENTO",{"$nulls":6},0]
[{"$nulls":3},113,{"$nulls":3},"SE REQUIERE ASIGNAR LA FUENTE DE FINANCIAMIENTO",{"$nulls":6},0]
[{"$nulls":3},113,{"$nulls":3},"SE REQUIERE ASIGNAR LA FUENTE DE FINANCIAMIENTO",{"$nulls":6},0]
[{"$nulls":3},113,{"$nulls":3},"SE REQUIERE ASIGNAR LA FUENTE DE FINANCIAMIENTO",{"$nulls":6},0]
[{"$nulls":3},113,{"$nulls":3},"SE REQUIERE ASIGNAR LA FUENTE DE FINANCIAMIENTO",{"$nulls":6},0]
[{"$nulls":3},113,{"$nulls":3},"SE REQUIERE ASIGNAR LA FUENTE DE FINANCIAMIENTO",{"$nulls":6},0]
[{"$nulls":3},113,{"$nulls":3},"SE REQUIERE ASIGNAR LA FUENTE DE FINANCIAMIENTO",{"$nulls":6},0]
[{"$nulls":3},113,{"$nulls":3},"SE REQUIERE ASIGNAR LA FUENTE DE FINANCIAMIENTO",{"$nulls":6},0]
[{"$nulls":3},113,{"$nulls":3},"SE REQUIERE ASIGNAR LA FUENTE DE FINANCIAMIENTO",{"$nulls":6},0]
[{"$nulls":3},113,{"$nulls":3},"SE REQUIERE ASIGNAR LA FUENTE DE FINANCIAMIENTO",{"$nulls":6},0]
[{"$nulls":3},113,{"$nulls":3},"SE REQUIERE ASIGNAR LA FUENTE DE FINANCIAMIENTO",{"$nulls":6},0]
[{"$nulls":3},113,{"$nulls":3},"SE REQUIERE ASIGNAR LA FUENTE DE FINANCIAMIENTO",{"$nulls":6},0]
[{"$nulls":3},113,{"$nulls":3},"SE REQUIERE ASIGNAR LA FUENTE DE FINANCIAMIENTO",{"$nulls":6},0]
[{"$nulls":3},113,{"$nulls":3},"SE REQUIERE ASIGNAR LA FUENTE DE FINANCIAMIENTO",{"$nulls":6},0]
[{"$nulls":3},113,{"$nulls":3},"SE REQUIERE ASIGNAR LA FUENTE DE FINANCIAMIENTO",{"$nulls":6},0]
[{"$nulls":3},113,{"$nulls":3},"SE REQUIERE ASIGNAR LA FUENTE DE FINANCIAMIENTO",{"$nulls":6},0]
[{"$nulls":3},113,{"$nulls":3},{"$f":"IF(E388=\"\",\"SE REQUIERE ASIGNAR LA FUENTE DE FINANCIAMIENTO\",IF(F388=\"\",\"ES NECESARIO ESTABLECER EL NÚMERO DE PLAZAS\",IF(G388=\"\",\"SE NECESITA ESTABLECER UN MONTO MENSUAL\",F388*G388*12)))","v":"SE REQUIERE ASIGNAR LA FUENTE DE FINANCIAMIENTO"},{"$nulls":6},{"$f":"SUM(H388:N388)","v":0}]
[{"$nulls":3},113,{"$nulls":3},"SE REQUIERE ASIGNAR LA FUENTE DE FINANCIAMIENTO",{"$nulls":6},0]
[{"$nulls":3},113,{"$nulls":3},"SE REQUIERE ASIGNAR LA FUENTE DE FINANCIAMIENTO",{"$nulls":6},0]
[{"$nulls":3},113,{"$nulls":3},"SE REQUIERE ASIGNAR LA FUENTE DE FINANCIAMIENTO",{"$nulls":6},0]
[{"$nulls":3},113,{"$nulls":3},"SE REQUIERE ASIGNAR LA FUENTE DE FINANCIAMIENTO",{"$nulls":6},0]
[{"$nulls":3},113,{"$nulls":3},"SE REQUIERE ASIGNAR LA FUENTE DE FINANCIAMIENTO",{"$nulls":6},0]
[{"$nulls":3},113,{"$nulls":3},"SE REQUIERE ASIGNAR LA FUENTE DE FINANCIAMIENTO",{"$nulls":6},0]
[{"$nulls":3},113,{"$nulls":3},"SE REQUIERE ASIGNAR LA FUENTE DE FINANCIAMIENTO",{"$nulls":6},0]
[{"$nulls":3},113,{"$nulls":3},"SE REQUIERE ASIGNAR LA FUENTE DE FINANCIAMIENTO",{"$nulls":6},0]
[{"$nulls":3},113,{"$nulls":3},"SE REQUIERE ASIGNAR LA FUENTE DE FINANCIAMIENTO",{"$nulls":6},0]
[{"$nulls":3},113,{"$nulls":3},"SE REQUIERE ASIGNAR LA FUENTE DE FINANCIAMIENTO",{"$nulls":6},0]
[{"$nulls":3},113,{"$nulls":3},"SE REQUIERE ASIGNAR LA FUENTE DE FINANCIAMIENTO",{"$nulls":6},0]
[{"$nulls":3},113,{"$nulls":3},"SE REQUIERE ASIGNAR LA FUENTE DE FINANCIAMIENTO",{"$nulls":6},0]
[{"$nulls":3},113,{"$nulls":3},"SE REQUIERE ASIGNAR LA FUENTE DE FINANCIAMIENTO",{"$nulls":6},0]
[{"$nulls":3},113,{"$nulls":3},"SE REQUIERE ASIGNAR LA FUENTE DE FINANCIAMIENTO",{"$nulls":6},0]
[{"$nulls":3},113,{"$nulls":3},"SE REQUIERE ASIGNAR LA FUENTE DE FINANCIAMIENTO",{"$nulls":6},0]
[{"$nulls":3},113,{"$nulls":3},"SE REQUIERE ASIGNAR LA FUENTE DE FINANCIAMIENTO",{"$nulls":6},0]
[{"$nulls":3},113,{"$nulls":3},"SE REQUIERE ASIGNAR LA FUENTE DE FINANCIAMIENTO",{"$nulls":6},0]
[{"$nulls":3},113,{"$nulls":3},"SE REQUIERE ASIGNAR LA FUENTE DE FINANCIAMIENTO",{"$nulls":6},0]
[{"$nulls":3},113,{"$nulls":3},"SE REQUIERE ASIGNAR LA FUENTE DE FINANCIAMIENTO",{"$nulls":6},0]
[{"$nulls":3},113,{"$nulls":3},"SE REQUIERE ASIGNAR LA FUENTE DE FINANCIAMIENTO",{"$nulls":6},0]
[{"$nulls":3},113,{"$nulls":3},"SE REQUIERE ASIGNAR LA FUENTE DE FINANCIAMIENTO",{"$nulls":6},0]
[{"$nulls":3},113,{"$nulls":3},"SE REQUIERE ASIGNAR LA FUENTE DE FINANCIAMIENTO",{"$nulls":6},0]
[{"$nulls":3},113,{"$nulls":3},"SE REQUIERE ASIGNAR LA FUENTE DE FINANCIAMIENTO",{"$nulls":6},0]
[{"$nulls":3},113,{"$nulls":3},"SE REQUIERE ASIGNAR LA FUENTE DE FINANCIAMIENTO",{"$nulls":6},0]
[{"$nulls":3},113,{"$nulls":3},"SE REQUIERE ASIGNAR LA FUENTE DE FINANCIAMIENTO",{"$nulls":6},0]
[{"$nulls":3},113,{"$nulls":3},"SE REQUIERE ASIGNAR LA FUENTE DE FINANCIAMIENTO",{"$nulls":6},0]
[{"$nulls":3},113,{"$nulls":3},"SE REQUIERE ASIGNAR LA FUENTE DE FINANCIAMIENTO",{"$nulls":6},0]
[{"$nulls":3},113,{"$nulls":3},"SE REQUIERE ASIGNAR LA FUENTE DE FINANCIAMIENTO",{"$nulls":6},0]
[{"$nulls":3},113,{"$nulls":3},"SE REQUIERE ASIGNAR LA FUENTE DE FINANCIAMIENTO",{"$nulls":6},0]
[{"$nulls":3},113,{"$nulls":3},"SE REQUIERE ASIGNAR LA FUENTE DE FINANCIAMIENTO",{"$nulls":6},0]
[{"$nulls":3},113,{"$nulls":3},"SE REQUIERE ASIGNAR LA FUENTE DE FINANCIAMIENTO",{"$nulls":6},0]
[{"$nulls":3},113,{"$nulls":3},"SE REQUIERE ASIGNAR LA FUENTE DE FINANCIAMIENTO",{"$nulls":6},0]
[{"$nulls":3},113,{"$nulls":3},"SE REQUIERE ASIGNAR LA FUENTE DE FINANCIAMIENTO",{"$nulls":6},0]
[{"$nulls":3},113,{"$nulls":3},"SE REQUIERE ASIGNAR LA FUENTE DE FINANCIAMIENTO",{"$nulls":6},0]
[{"$nulls":3},113,{"$nulls":3},"SE REQUIERE ASIGNAR LA FUENTE DE FINANCIAMIENTO",{"$nulls":6},0]
[{"$nulls":3},113,{"$nulls":3},"SE REQUIERE ASIGNAR LA FUENTE DE FINANCIAMIENTO",{"$nulls":6},0]
[{"$nulls":3},113,{"$nulls":3},"SE REQUIERE ASIGNAR LA FUENTE DE FINANCIAMIENTO",{"$nulls":6},0]
[{"$nulls":3},113,{"$nulls":3},"SE REQUIERE ASIGNAR LA FUENTE DE FINANCIAMIENTO",{"$nulls":6},0]
[{"$nulls":3},113,{"$nulls":3},"SE REQUIERE ASIGNAR LA FUENTE DE FINANCIAMIENTO",{"$nulls":6},0]
[{"$nulls":3},113,{"$nulls":3},"SE REQUIERE ASIGNAR LA FUENTE DE FINANCIAMIENTO",{"$nulls":6},0]
[null,"TOTALES",{"$nulls":3},{"$f":"SUM(F3:F428)","v":14},{"v":98336,"d":"98,336"},{"v":1180032,"d":"1,180,032"},{"$f":"SUM(I3:I428)","v":0},{"v":16177,"d":"16,177"},{"v":161735,"d":"161,735"},0,0,0,{"$f":"SUM(O3:O428)","v":{"v":1357944,"d":"1,357,944"}}]